Help us understand the problem. What is going on with this article?

docker(24) Open jij導入失敗(2)何度もやりなおし。のち成功。

More than 1 year has passed since last update.

Open jij導入失敗
https://qiita.com/kaizen_nagoya/items/11cb393d5b8ce9019cd6

ではdocker の anacondaで始めた。
apt update, apt -y apgradeしてないことに気が付いた。
cmakeが入っていないとまずいことが途中でわかった。
今回は素のubuntuで始めてみる。

macOS
$ docker run -it ubuntu /bin/bash
docker
# apt update; apt -y upgrade
Get:1 http://security.ubuntu.com/ubuntu bionic-security InRelease [88.7 kB]
Get:2 http://archive.ubuntu.com/ubuntu bionic InRelease [242 kB]
Get:3 http://security.ubuntu.com/ubuntu bionic-security/restricted amd64 Packages [5436 B]
Get:4 http://security.ubuntu.com/ubuntu bionic-security/main amd64 Packages [557 kB]
Get:5 http://archive.ubuntu.com/ubuntu bionic-updates InRelease [88.7 kB]
Get:6 http://security.ubuntu.com/ubuntu bionic-security/universe amd64 Packages [719 kB]
Get:7 http://security.ubuntu.com/ubuntu bionic-security/multiverse amd64 Packages [4169 B]
Get:8 http://archive.ubuntu.com/ubuntu bionic-backports InRelease [74.6 kB]
Get:9 http://archive.ubuntu.com/ubuntu bionic/main amd64 Packages [1344 kB]
Get:10 http://archive.ubuntu.com/ubuntu bionic/multiverse amd64 Packages [186 kB]           
Get:11 http://archive.ubuntu.com/ubuntu bionic/restricted amd64 Packages [13.5 kB]          
Get:12 http://archive.ubuntu.com/ubuntu bionic/universe amd64 Packages [11.3 MB]            
Get:13 http://archive.ubuntu.com/ubuntu bionic-updates/multiverse amd64 Packages [7239 B]   
Get:14 http://archive.ubuntu.com/ubuntu bionic-updates/universe amd64 Packages [1226 kB]    
Get:15 http://archive.ubuntu.com/ubuntu bionic-updates/restricted amd64 Packages [10.8 kB]  
Get:16 http://archive.ubuntu.com/ubuntu bionic-updates/main amd64 Packages [861 kB]         
Get:17 http://archive.ubuntu.com/ubuntu bionic-backports/main amd64 Packages [2496 B]       
Get:18 http://archive.ubuntu.com/ubuntu bionic-backports/universe amd64 Packages [3927 B]   
Fetched 16.8 MB in 17s (977 kB/s)                                                           
Reading package lists... Done
Building dependency tree       
Reading state information... Done
12 packages can be upgraded. Run 'apt list --upgradable' to see them.
Reading package lists... Done
Building dependency tree       
Reading state information... Done
Calculating upgrade... Done
The following packages will be upgraded:
  apt bash debconf gcc-8-base libapt-pkg5.0 libdb5.3 libgcc1 libgnutls30 libseccomp2
  libstdc++6 libsystemd0 libudev1
12 upgraded, 0 newly installed, 0 to remove and 0 not upgraded.
Need to get 4784 kB of archives.
After this operation, 20.5 kB of additional disk space will be used.
Get:1 http://archive.ubuntu.com/ubuntu bionic-updates/main amd64 bash amd64 4.4.18-2ubuntu1.1 [615 kB]
Get:2 http://archive.ubuntu.com/ubuntu bionic-updates/main amd64 gcc-8-base amd64 8.3.0-6ubuntu1~18.04.1 [18.7 kB]
Get:3 http://archive.ubuntu.com/ubuntu bionic-updates/main amd64 libgcc1 amd64 1:8.3.0-6ubuntu1~18.04.1 [40.7 kB]
Get:4 http://archive.ubuntu.com/ubuntu bionic-updates/main amd64 libstdc++6 amd64 8.3.0-6ubuntu1~18.04.1 [400 kB]
Get:5 http://archive.ubuntu.com/ubuntu bionic-updates/main amd64 libsystemd0 amd64 237-3ubuntu10.23 [204 kB]
Get:6 http://archive.ubuntu.com/ubuntu bionic-updates/main amd64 libudev1 amd64 237-3ubuntu10.23 [53.6 kB]
Get:7 http://archive.ubuntu.com/ubuntu bionic-updates/main amd64 libapt-pkg5.0 amd64 1.6.11 [806 kB]
Get:8 http://archive.ubuntu.com/ubuntu bionic-updates/main amd64 libgnutls30 amd64 3.5.18-1ubuntu1.1 [645 kB]
Get:9 http://archive.ubuntu.com/ubuntu bionic-updates/main amd64 libseccomp2 amd64 2.4.1-0ubuntu0.18.04.2 [39.1 kB]
Get:10 http://archive.ubuntu.com/ubuntu bionic-updates/main amd64 apt amd64 1.6.11 [1166 kB]
Get:11 http://archive.ubuntu.com/ubuntu bionic-updates/main amd64 debconf all 1.5.66ubuntu1 [124 kB]
Get:12 http://archive.ubuntu.com/ubuntu bionic-updates/main amd64 libdb5.3 amd64 5.3.28-13.1ubuntu1.1 [672 kB]
Fetched 4784 kB in 4s (1132 kB/s)
debconf: delaying package configuration, since apt-utils is not installed
(Reading database ... 4040 files and directories currently installed.)
Preparing to unpack .../bash_4.4.18-2ubuntu1.1_amd64.deb ...
Unpacking bash (4.4.18-2ubuntu1.1) over (4.4.18-2ubuntu1) ...
Setting up bash (4.4.18-2ubuntu1.1) ...
update-alternatives: error: alternative path /usr/share/man/man7/bash-builtins.7.gz doesn't exist
(Reading database ... 4040 files and directories currently installed.)
Preparing to unpack .../gcc-8-base_8.3.0-6ubuntu1~18.04.1_amd64.deb ...
Unpacking gcc-8-base:amd64 (8.3.0-6ubuntu1~18.04.1) over (8.3.0-6ubuntu1~18.04) ...
Setting up gcc-8-base:amd64 (8.3.0-6ubuntu1~18.04.1) ...
(Reading database ... 4040 files and directories currently installed.)
Preparing to unpack .../libgcc1_1%3a8.3.0-6ubuntu1~18.04.1_amd64.deb ...
Unpacking libgcc1:amd64 (1:8.3.0-6ubuntu1~18.04.1) over (1:8.3.0-6ubuntu1~18.04) ...
Setting up libgcc1:amd64 (1:8.3.0-6ubuntu1~18.04.1) ...
(Reading database ... 4040 files and directories currently installed.)
Preparing to unpack .../libstdc++6_8.3.0-6ubuntu1~18.04.1_amd64.deb ...
Unpacking libstdc++6:amd64 (8.3.0-6ubuntu1~18.04.1) over (8.3.0-6ubuntu1~18.04) ...
Setting up libstdc++6:amd64 (8.3.0-6ubuntu1~18.04.1) ...
(Reading database ... 4040 files and directories currently installed.)
Preparing to unpack .../libsystemd0_237-3ubuntu10.23_amd64.deb ...
Unpacking libsystemd0:amd64 (237-3ubuntu10.23) over (237-3ubuntu10.21) ...
Setting up libsystemd0:amd64 (237-3ubuntu10.23) ...
(Reading database ... 4040 files and directories currently installed.)
Preparing to unpack .../libudev1_237-3ubuntu10.23_amd64.deb ...
Unpacking libudev1:amd64 (237-3ubuntu10.23) over (237-3ubuntu10.21) ...
Setting up libudev1:amd64 (237-3ubuntu10.23) ...
(Reading database ... 4040 files and directories currently installed.)
Preparing to unpack .../libapt-pkg5.0_1.6.11_amd64.deb ...
Unpacking libapt-pkg5.0:amd64 (1.6.11) over (1.6.10) ...
Setting up libapt-pkg5.0:amd64 (1.6.11) ...
(Reading database ... 4040 files and directories currently installed.)
Preparing to unpack .../libgnutls30_3.5.18-1ubuntu1.1_amd64.deb ...
Unpacking libgnutls30:amd64 (3.5.18-1ubuntu1.1) over (3.5.18-1ubuntu1) ...
Setting up libgnutls30:amd64 (3.5.18-1ubuntu1.1) ...
(Reading database ... 4040 files and directories currently installed.)
Preparing to unpack .../libseccomp2_2.4.1-0ubuntu0.18.04.2_amd64.deb ...
Unpacking libseccomp2:amd64 (2.4.1-0ubuntu0.18.04.2) over (2.3.1-2.1ubuntu4.1) ...
Setting up libseccomp2:amd64 (2.4.1-0ubuntu0.18.04.2) ...
(Reading database ... 4040 files and directories currently installed.)
Preparing to unpack .../archives/apt_1.6.11_amd64.deb ...
Unpacking apt (1.6.11) over (1.6.10) ...
Setting up apt (1.6.11) ...
Installing new version of config file /etc/apt/apt.conf.d/01autoremove ...
(Reading database ... 4040 files and directories currently installed.)
Preparing to unpack .../debconf_1.5.66ubuntu1_all.deb ...
Unpacking debconf (1.5.66ubuntu1) over (1.5.66) ...
Setting up debconf (1.5.66ubuntu1) ...
debconf: unable to initialize frontend: Dialog
debconf: (No usable dialog-like program is installed, so the dialog based frontend cannot be used. at /usr/share/perl5/Debconf/FrontEnd/Dialog.pm line 76.)
debconf: falling back to frontend: Readline
debconf: unable to initialize frontend: Readline
debconf: (Can't locate Term/ReadLine.pm in @INC (you may need to install the Term::ReadLine module) (@INC contains: /etc/perl /usr/local/lib/x86_64-linux-gnu/perl/5.26.1 /usr/local/share/perl/5.26.1 /usr/lib/x86_64-linux-gnu/perl5/5.26 /usr/share/perl5 /usr/lib/x86_64-linux-gnu/perl/5.26 /usr/share/perl/5.26 /usr/local/lib/site_perl /usr/lib/x86_64-linux-gnu/perl-base) at /usr/share/perl5/Debconf/FrontEnd/Readline.pm line 7.)
debconf: falling back to frontend: Teletype
(Reading database ... 4040 files and directories currently installed.)
Preparing to unpack .../libdb5.3_5.3.28-13.1ubuntu1.1_amd64.deb ...
Unpacking libdb5.3:amd64 (5.3.28-13.1ubuntu1.1) over (5.3.28-13.1ubuntu1) ...
Setting up libdb5.3:amd64 (5.3.28-13.1ubuntu1.1) ...
Processing triggers for libc-bin (2.27-3ubuntu1) ...
root@02b32b9272ce:/# apt install python3
Reading package lists... Done
Building dependency tree       
Reading state information... Done
The following additional packages will be installed:
  file libexpat1 libmagic-mgc libmagic1 libmpdec2 libpython3-stdlib libpython3.6-minimal
  libpython3.6-stdlib libreadline7 libsqlite3-0 libssl1.1 mime-support python3-minimal
  python3.6 python3.6-minimal readline-common xz-utils
Suggested packages:
  python3-doc python3-tk python3-venv python3.6-venv python3.6-doc binutils binfmt-support
  readline-doc
The following NEW packages will be installed:
  file libexpat1 libmagic-mgc libmagic1 libmpdec2 libpython3-stdlib libpython3.6-minimal
  libpython3.6-stdlib libreadline7 libsqlite3-0 libssl1.1 mime-support python3
  python3-minimal python3.6 python3.6-minimal readline-common xz-utils
0 upgraded, 18 newly installed, 0 to remove and 0 not upgraded.
Need to get 6670 kB of archives.
After this operation, 34.1 MB of additional disk space will be used.
Do you want to continue? [Y/n] y
Get:1 http://archive.ubuntu.com/ubuntu bionic-updates/main amd64 libssl1.1 amd64 1.1.1-1ubuntu2.1~18.04.3 [1295 kB]
Get:2 http://archive.ubuntu.com/ubuntu bionic-updates/main amd64 libpython3.6-minimal amd64 3.6.8-1~18.04.1 [533 kB]
Get:3 http://archive.ubuntu.com/ubuntu bionic/main amd64 libexpat1 amd64 2.2.5-3 [80.2 kB]
Get:4 http://archive.ubuntu.com/ubuntu bionic-updates/main amd64 python3.6-minimal amd64 3.6.8-1~18.04.1 [1620 kB]
Get:5 http://archive.ubuntu.com/ubuntu bionic-updates/main amd64 python3-minimal amd64 3.6.7-1~18.04 [23.7 kB]
Get:6 http://archive.ubuntu.com/ubuntu bionic/main amd64 mime-support all 3.60ubuntu1 [30.1 kB]
Get:7 http://archive.ubuntu.com/ubuntu bionic/main amd64 libmpdec2 amd64 2.4.2-1ubuntu1 [84.1 kB]
Get:8 http://archive.ubuntu.com/ubuntu bionic/main amd64 readline-common all 7.0-3 [52.9 kB]
Get:9 http://archive.ubuntu.com/ubuntu bionic/main amd64 libreadline7 amd64 7.0-3 [124 kB]
Get:10 http://archive.ubuntu.com/ubuntu bionic-updates/main amd64 libsqlite3-0 amd64 3.22.0-1ubuntu0.1 [497 kB]
Get:11 http://archive.ubuntu.com/ubuntu bionic-updates/main amd64 libpython3.6-stdlib amd64 3.6.8-1~18.04.1 [1715 kB]
Get:12 http://archive.ubuntu.com/ubuntu bionic-updates/main amd64 python3.6 amd64 3.6.8-1~18.04.1 [202 kB]
Get:13 http://archive.ubuntu.com/ubuntu bionic-updates/main amd64 libpython3-stdlib amd64 3.6.7-1~18.04 [7240 B]
Get:14 http://archive.ubuntu.com/ubuntu bionic-updates/main amd64 python3 amd64 3.6.7-1~18.04 [47.2 kB]
Get:15 http://archive.ubuntu.com/ubuntu bionic-updates/main amd64 libmagic-mgc amd64 1:5.32-2ubuntu0.2 [184 kB]
Get:16 http://archive.ubuntu.com/ubuntu bionic-updates/main amd64 libmagic1 amd64 1:5.32-2ubuntu0.2 [68.5 kB]
Get:17 http://archive.ubuntu.com/ubuntu bionic-updates/main amd64 file amd64 1:5.32-2ubuntu0.2 [22.1 kB]
Get:18 http://archive.ubuntu.com/ubuntu bionic/main amd64 xz-utils amd64 5.2.2-1.3 [83.8 kB]
Fetched 6670 kB in 5s (1272 kB/s)    
debconf: delaying package configuration, since apt-utils is not installed
Selecting previously unselected package libssl1.1:amd64.
(Reading database ... 4040 files and directories currently installed.)
Preparing to unpack .../libssl1.1_1.1.1-1ubuntu2.1~18.04.3_amd64.deb ...
Unpacking libssl1.1:amd64 (1.1.1-1ubuntu2.1~18.04.3) ...
Selecting previously unselected package libpython3.6-minimal:amd64.
Preparing to unpack .../libpython3.6-minimal_3.6.8-1~18.04.1_amd64.deb ...
Unpacking libpython3.6-minimal:amd64 (3.6.8-1~18.04.1) ...
Selecting previously unselected package libexpat1:amd64.
Preparing to unpack .../libexpat1_2.2.5-3_amd64.deb ...
Unpacking libexpat1:amd64 (2.2.5-3) ...
Selecting previously unselected package python3.6-minimal.
Preparing to unpack .../python3.6-minimal_3.6.8-1~18.04.1_amd64.deb ...
Unpacking python3.6-minimal (3.6.8-1~18.04.1) ...
Setting up libssl1.1:amd64 (1.1.1-1ubuntu2.1~18.04.3) ...
debconf: unable to initialize frontend: Dialog
debconf: (No usable dialog-like program is installed, so the dialog based frontend cannot be used. at /usr/share/perl5/Debconf/FrontEnd/Dialog.pm line 76.)
debconf: falling back to frontend: Readline
debconf: unable to initialize frontend: Readline
debconf: (Can't locate Term/ReadLine.pm in @INC (you may need to install the Term::ReadLine module) (@INC contains: /etc/perl /usr/local/lib/x86_64-linux-gnu/perl/5.26.1 /usr/local/share/perl/5.26.1 /usr/lib/x86_64-linux-gnu/perl5/5.26 /usr/share/perl5 /usr/lib/x86_64-linux-gnu/perl/5.26 /usr/share/perl/5.26 /usr/local/lib/site_perl /usr/lib/x86_64-linux-gnu/perl-base) at /usr/share/perl5/Debconf/FrontEnd/Readline.pm line 7.)
debconf: falling back to frontend: Teletype
Setting up libpython3.6-minimal:amd64 (3.6.8-1~18.04.1) ...
Setting up libexpat1:amd64 (2.2.5-3) ...
Setting up python3.6-minimal (3.6.8-1~18.04.1) ...
Selecting previously unselected package python3-minimal.
(Reading database ... 4297 files and directories currently installed.)
Preparing to unpack .../0-python3-minimal_3.6.7-1~18.04_amd64.deb ...
Unpacking python3-minimal (3.6.7-1~18.04) ...
Selecting previously unselected package mime-support.
Preparing to unpack .../1-mime-support_3.60ubuntu1_all.deb ...
Unpacking mime-support (3.60ubuntu1) ...
Selecting previously unselected package libmpdec2:amd64.
Preparing to unpack .../2-libmpdec2_2.4.2-1ubuntu1_amd64.deb ...
Unpacking libmpdec2:amd64 (2.4.2-1ubuntu1) ...
Selecting previously unselected package readline-common.
Preparing to unpack .../3-readline-common_7.0-3_all.deb ...
Unpacking readline-common (7.0-3) ...
Selecting previously unselected package libreadline7:amd64.
Preparing to unpack .../4-libreadline7_7.0-3_amd64.deb ...
Unpacking libreadline7:amd64 (7.0-3) ...
Selecting previously unselected package libsqlite3-0:amd64.
Preparing to unpack .../5-libsqlite3-0_3.22.0-1ubuntu0.1_amd64.deb ...
Unpacking libsqlite3-0:amd64 (3.22.0-1ubuntu0.1) ...
Selecting previously unselected package libpython3.6-stdlib:amd64.
Preparing to unpack .../6-libpython3.6-stdlib_3.6.8-1~18.04.1_amd64.deb ...
Unpacking libpython3.6-stdlib:amd64 (3.6.8-1~18.04.1) ...
Selecting previously unselected package python3.6.
Preparing to unpack .../7-python3.6_3.6.8-1~18.04.1_amd64.deb ...
Unpacking python3.6 (3.6.8-1~18.04.1) ...
Selecting previously unselected package libpython3-stdlib:amd64.
Preparing to unpack .../8-libpython3-stdlib_3.6.7-1~18.04_amd64.deb ...
Unpacking libpython3-stdlib:amd64 (3.6.7-1~18.04) ...
Setting up python3-minimal (3.6.7-1~18.04) ...
Selecting previously unselected package python3.
(Reading database ... 4755 files and directories currently installed.)
Preparing to unpack .../python3_3.6.7-1~18.04_amd64.deb ...
Unpacking python3 (3.6.7-1~18.04) ...
Selecting previously unselected package libmagic-mgc.
Preparing to unpack .../libmagic-mgc_1%3a5.32-2ubuntu0.2_amd64.deb ...
Unpacking libmagic-mgc (1:5.32-2ubuntu0.2) ...
Selecting previously unselected package libmagic1:amd64.
Preparing to unpack .../libmagic1_1%3a5.32-2ubuntu0.2_amd64.deb ...
Unpacking libmagic1:amd64 (1:5.32-2ubuntu0.2) ...
Selecting previously unselected package file.
Preparing to unpack .../file_1%3a5.32-2ubuntu0.2_amd64.deb ...
Unpacking file (1:5.32-2ubuntu0.2) ...
Selecting previously unselected package xz-utils.
Preparing to unpack .../xz-utils_5.2.2-1.3_amd64.deb ...
Unpacking xz-utils (5.2.2-1.3) ...
Setting up readline-common (7.0-3) ...
Setting up mime-support (3.60ubuntu1) ...
Setting up libreadline7:amd64 (7.0-3) ...
Setting up libmagic-mgc (1:5.32-2ubuntu0.2) ...
Setting up libmagic1:amd64 (1:5.32-2ubuntu0.2) ...
Processing triggers for libc-bin (2.27-3ubuntu1) ...
Setting up xz-utils (5.2.2-1.3) ...
update-alternatives: using /usr/bin/xz to provide /usr/bin/lzma (lzma) in auto mode
update-alternatives: warning: skip creation of /usr/share/man/man1/lzma.1.gz because associated file /usr/share/man/man1/xz.1.gz (of link group lzma) doesn't exist
update-alternatives: warning: skip creation of /usr/share/man/man1/unlzma.1.gz because associated file /usr/share/man/man1/unxz.1.gz (of link group lzma) doesn't exist
update-alternatives: warning: skip creation of /usr/share/man/man1/lzcat.1.gz because associated file /usr/share/man/man1/xzcat.1.gz (of link group lzma) doesn't exist
update-alternatives: warning: skip creation of /usr/share/man/man1/lzmore.1.gz because associated file /usr/share/man/man1/xzmore.1.gz (of link group lzma) doesn't exist
update-alternatives: warning: skip creation of /usr/share/man/man1/lzless.1.gz because associated file /usr/share/man/man1/xzless.1.gz (of link group lzma) doesn't exist
update-alternatives: warning: skip creation of /usr/share/man/man1/lzdiff.1.gz because associated file /usr/share/man/man1/xzdiff.1.gz (of link group lzma) doesn't exist
update-alternatives: warning: skip creation of /usr/share/man/man1/lzcmp.1.gz because associated file /usr/share/man/man1/xzcmp.1.gz (of link group lzma) doesn't exist
update-alternatives: warning: skip creation of /usr/share/man/man1/lzgrep.1.gz because associated file /usr/share/man/man1/xzgrep.1.gz (of link group lzma) doesn't exist
update-alternatives: warning: skip creation of /usr/share/man/man1/lzegrep.1.gz because associated file /usr/share/man/man1/xzegrep.1.gz (of link group lzma) doesn't exist
update-alternatives: warning: skip creation of /usr/share/man/man1/lzfgrep.1.gz because associated file /usr/share/man/man1/xzfgrep.1.gz (of link group lzma) doesn't exist
Setting up libsqlite3-0:amd64 (3.22.0-1ubuntu0.1) ...
Setting up libmpdec2:amd64 (2.4.2-1ubuntu1) ...
Setting up libpython3.6-stdlib:amd64 (3.6.8-1~18.04.1) ...
Setting up python3.6 (3.6.8-1~18.04.1) ...
Setting up file (1:5.32-2ubuntu0.2) ...
Setting up libpython3-stdlib:amd64 (3.6.7-1~18.04) ...
Setting up python3 (3.6.7-1~18.04) ...
running python rtupdate hooks for python3.6...
running python post-rtupdate hooks for python3.6...
Processing triggers for libc-bin (2.27-3ubuntu1) ...

root@02b32b9272ce:/# apt install pip
Reading package lists... Done
Building dependency tree       
Reading state information... Done
E: Unable to locate package pip

root@02b32b9272ce:/# apt install cmake
Reading package lists... Done
Building dependency tree       
Reading state information... Done
The following additional packages will be installed:
  binutils binutils-common binutils-x86-64-linux-gnu ca-certificates cmake-data cpp cpp-7
  gcc gcc-7 gcc-7-base krb5-locales libarchive13 libasan4 libasn1-8-heimdal libatomic1
  libbinutils libc-dev-bin libc6-dev libcc1-0 libcilkrts5 libcurl4 libgcc-7-dev libgomp1
  libgssapi-krb5-2 libgssapi3-heimdal libhcrypto4-heimdal libheimbase1-heimdal
  libheimntlm0-heimdal libhx509-5-heimdal libicu60 libisl19 libitm1 libjsoncpp1
  libk5crypto3 libkeyutils1 libkrb5-26-heimdal libkrb5-3 libkrb5support0 libldap-2.4-2
  libldap-common liblsan0 liblzo2-2 libmpc3 libmpfr6 libmpx2 libnghttp2-14 libpsl5
  libquadmath0 librhash0 libroken18-heimdal librtmp1 libsasl2-2 libsasl2-modules
  libsasl2-modules-db libtsan0 libubsan0 libuv1 libwind0-heimdal libxml2 linux-libc-dev
  make manpages manpages-dev multiarch-support openssl publicsuffix
Suggested packages:
  binutils-doc cmake-doc ninja-build cpp-doc gcc-7-locales gcc-multilib autoconf automake
  libtool flex bison gdb gcc-doc gcc-7-multilib gcc-7-doc libgcc1-dbg libgomp1-dbg
  libitm1-dbg libatomic1-dbg libasan4-dbg liblsan0-dbg libtsan0-dbg libubsan0-dbg
  libcilkrts5-dbg libmpx2-dbg libquadmath0-dbg lrzip glibc-doc krb5-doc krb5-user
  libsasl2-modules-gssapi-mit | libsasl2-modules-gssapi-heimdal libsasl2-modules-ldap
  libsasl2-modules-otp libsasl2-modules-sql make-doc man-browser
The following NEW packages will be installed:
  binutils binutils-common binutils-x86-64-linux-gnu ca-certificates cmake cmake-data cpp
  cpp-7 gcc gcc-7 gcc-7-base krb5-locales libarchive13 libasan4 libasn1-8-heimdal
  libatomic1 libbinutils libc-dev-bin libc6-dev libcc1-0 libcilkrts5 libcurl4 libgcc-7-dev
  libgomp1 libgssapi-krb5-2 libgssapi3-heimdal libhcrypto4-heimdal libheimbase1-heimdal
  libheimntlm0-heimdal libhx509-5-heimdal libicu60 libisl19 libitm1 libjsoncpp1
  libk5crypto3 libkeyutils1 libkrb5-26-heimdal libkrb5-3 libkrb5support0 libldap-2.4-2
  libldap-common liblsan0 liblzo2-2 libmpc3 libmpfr6 libmpx2 libnghttp2-14 libpsl5
  libquadmath0 librhash0 libroken18-heimdal librtmp1 libsasl2-2 libsasl2-modules
  libsasl2-modules-db libtsan0 libubsan0 libuv1 libwind0-heimdal libxml2 linux-libc-dev
  make manpages manpages-dev multiarch-support openssl publicsuffix
0 upgraded, 67 newly installed, 0 to remove and 0 not upgraded.
Need to get 45.2 MB of archives.
After this operation, 187 MB of additional disk space will be used.
Do you want to continue? [Y/n] y
Get:1 http://archive.ubuntu.com/ubuntu bionic/main amd64 multiarch-support amd64 2.27-3ubuntu1 [6916 B]
Get:2 http://archive.ubuntu.com/ubuntu bionic/main amd64 liblzo2-2 amd64 2.08-1.2 [48.7 kB]
Get:3 http://archive.ubuntu.com/ubuntu bionic-updates/main amd64 openssl amd64 1.1.1-1ubuntu2.1~18.04.3 [614 kB]
Get:4 http://archive.ubuntu.com/ubuntu bionic/main amd64 ca-certificates all 20180409 [151 kB]
Get:5 http://archive.ubuntu.com/ubuntu bionic/main amd64 libicu60 amd64 60.2-3ubuntu3 [8054 kB]
Get:6 http://archive.ubuntu.com/ubuntu bionic-updates/main amd64 libxml2 amd64 2.9.4+dfsg1-6.1ubuntu1.2 [663 kB]
Get:7 http://archive.ubuntu.com/ubuntu bionic-updates/main amd64 krb5-locales all 1.16-2ubuntu0.1 [13.5 kB]
Get:8 http://archive.ubuntu.com/ubuntu bionic-updates/main amd64 libkrb5support0 amd64 1.16-2ubuntu0.1 [30.9 kB]
Get:9 http://archive.ubuntu.com/ubuntu bionic-updates/main amd64 libk5crypto3 amd64 1.16-2ubuntu0.1 [85.6 kB]
Get:10 http://archive.ubuntu.com/ubuntu bionic/main amd64 libkeyutils1 amd64 1.5.9-9.2ubuntu2 [8720 B]
Get:11 http://archive.ubuntu.com/ubuntu bionic-updates/main amd64 libkrb5-3 amd64 1.16-2ubuntu0.1 [279 kB]
Get:12 http://archive.ubuntu.com/ubuntu bionic-updates/main amd64 libgssapi-krb5-2 amd64 1.16-2ubuntu0.1 [122 kB]
Get:13 http://archive.ubuntu.com/ubuntu bionic/main amd64 libpsl5 amd64 0.19.1-5build1 [41.8 kB]
Get:14 http://archive.ubuntu.com/ubuntu bionic/main amd64 manpages all 4.15-1 [1234 kB]
Get:15 http://archive.ubuntu.com/ubuntu bionic/main amd64 publicsuffix all 20180223.1310-1 [97.6 kB]
Get:16 http://archive.ubuntu.com/ubuntu bionic-updates/main amd64 binutils-common amd64 2.30-21ubuntu1~18.04.2 [193 kB]
Get:17 http://archive.ubuntu.com/ubuntu bionic-updates/main amd64 libbinutils amd64 2.30-21ubuntu1~18.04.2 [503 kB]
Get:18 http://archive.ubuntu.com/ubuntu bionic-updates/main amd64 binutils-x86-64-linux-gnu amd64 2.30-21ubuntu1~18.04.2 [1856 kB]
Get:19 http://archive.ubuntu.com/ubuntu bionic-updates/main amd64 binutils amd64 2.30-21ubuntu1~18.04.2 [3396 B]
Get:20 http://archive.ubuntu.com/ubuntu bionic/main amd64 cmake-data all 3.10.2-1ubuntu2 [1331 kB]
Get:21 http://archive.ubuntu.com/ubuntu bionic-updates/main amd64 libarchive13 amd64 3.2.2-3.1ubuntu0.3 [288 kB]
Get:22 http://archive.ubuntu.com/ubuntu bionic/main amd64 libroken18-heimdal amd64 7.5.0+dfsg-1 [41.3 kB]
Get:23 http://archive.ubuntu.com/ubuntu bionic/main amd64 libasn1-8-heimdal amd64 7.5.0+dfsg-1 [175 kB]
Get:24 http://archive.ubuntu.com/ubuntu bionic/main amd64 libheimbase1-heimdal amd64 7.5.0+dfsg-1 [29.3 kB]
Get:25 http://archive.ubuntu.com/ubuntu bionic/main amd64 libhcrypto4-heimdal amd64 7.5.0+dfsg-1 [85.9 kB]
Get:26 http://archive.ubuntu.com/ubuntu bionic/main amd64 libwind0-heimdal amd64 7.5.0+dfsg-1 [47.8 kB]
Get:27 http://archive.ubuntu.com/ubuntu bionic/main amd64 libhx509-5-heimdal amd64 7.5.0+dfsg-1 [107 kB]
Get:28 http://archive.ubuntu.com/ubuntu bionic/main amd64 libkrb5-26-heimdal amd64 7.5.0+dfsg-1 [206 kB]
Get:29 http://archive.ubuntu.com/ubuntu bionic/main amd64 libheimntlm0-heimdal amd64 7.5.0+dfsg-1 [14.8 kB]
Get:30 http://archive.ubuntu.com/ubuntu bionic/main amd64 libgssapi3-heimdal amd64 7.5.0+dfsg-1 [96.5 kB]
Get:31 http://archive.ubuntu.com/ubuntu bionic/main amd64 libsasl2-modules-db amd64 2.1.27~101-g0780600+dfsg-3ubuntu2 [14.8 kB]
Get:32 http://archive.ubuntu.com/ubuntu bionic/main amd64 libsasl2-2 amd64 2.1.27~101-g0780600+dfsg-3ubuntu2 [49.2 kB]
Get:33 http://archive.ubuntu.com/ubuntu bionic-updates/main amd64 libldap-common all 2.4.45+dfsg-1ubuntu1.2 [16.7 kB]
Get:34 http://archive.ubuntu.com/ubuntu bionic-updates/main amd64 libldap-2.4-2 amd64 2.4.45+dfsg-1ubuntu1.2 [155 kB]
Get:35 http://archive.ubuntu.com/ubuntu bionic/main amd64 libnghttp2-14 amd64 1.30.0-1ubuntu1 [77.8 kB]
Get:36 http://archive.ubuntu.com/ubuntu bionic/main amd64 librtmp1 amd64 2.4+20151223.gitfa8646d.1-1 [54.2 kB]
Get:37 http://archive.ubuntu.com/ubuntu bionic-updates/main amd64 libcurl4 amd64 7.58.0-2ubuntu3.7 [214 kB]
Get:38 http://archive.ubuntu.com/ubuntu bionic/main amd64 libjsoncpp1 amd64 1.7.4-3 [73.6 kB]
Get:39 http://archive.ubuntu.com/ubuntu bionic/main amd64 librhash0 amd64 1.3.6-2 [78.1 kB] 
Get:40 http://archive.ubuntu.com/ubuntu bionic/main amd64 libuv1 amd64 1.18.0-3 [64.4 kB]   
Get:41 http://archive.ubuntu.com/ubuntu bionic/main amd64 cmake amd64 3.10.2-1ubuntu2 [3138 kB]
Get:42 http://archive.ubuntu.com/ubuntu bionic-updates/main amd64 gcc-7-base amd64 7.4.0-1ubuntu1~18.04.1 [18.9 kB]
Get:43 http://archive.ubuntu.com/ubuntu bionic/main amd64 libisl19 amd64 0.19-1 [551 kB]    
Get:44 http://archive.ubuntu.com/ubuntu bionic/main amd64 libmpfr6 amd64 4.0.1-1 [243 kB]   
Get:45 http://archive.ubuntu.com/ubuntu bionic/main amd64 libmpc3 amd64 1.1.0-1 [40.8 kB]   
Get:46 http://archive.ubuntu.com/ubuntu bionic-updates/main amd64 cpp-7 amd64 7.4.0-1ubuntu1~18.04.1 [6742 kB]
Get:47 http://archive.ubuntu.com/ubuntu bionic-updates/main amd64 cpp amd64 4:7.4.0-1ubuntu2.3 [27.7 kB]
Get:48 http://archive.ubuntu.com/ubuntu bionic-updates/main amd64 libcc1-0 amd64 8.3.0-6ubuntu1~18.04.1 [47.4 kB]
Get:49 http://archive.ubuntu.com/ubuntu bionic-updates/main amd64 libgomp1 amd64 8.3.0-6ubuntu1~18.04.1 [76.4 kB]
Get:50 http://archive.ubuntu.com/ubuntu bionic-updates/main amd64 libitm1 amd64 8.3.0-6ubuntu1~18.04.1 [28.0 kB]
Get:51 http://archive.ubuntu.com/ubuntu bionic-updates/main amd64 libatomic1 amd64 8.3.0-6ubuntu1~18.04.1 [9184 B]
Get:52 http://archive.ubuntu.com/ubuntu bionic-updates/main amd64 libasan4 amd64 7.4.0-1ubuntu1~18.04.1 [359 kB]
Get:53 http://archive.ubuntu.com/ubuntu bionic-updates/main amd64 liblsan0 amd64 8.3.0-6ubuntu1~18.04.1 [133 kB]
Get:54 http://archive.ubuntu.com/ubuntu bionic-updates/main amd64 libtsan0 amd64 8.3.0-6ubuntu1~18.04.1 [288 kB]
Get:55 http://archive.ubuntu.com/ubuntu bionic-updates/main amd64 libubsan0 amd64 7.4.0-1ubuntu1~18.04.1 [126 kB]
Get:56 http://archive.ubuntu.com/ubuntu bionic-updates/main amd64 libcilkrts5 amd64 7.4.0-1ubuntu1~18.04.1 [42.5 kB]
Get:57 http://archive.ubuntu.com/ubuntu bionic-updates/main amd64 libmpx2 amd64 8.3.0-6ubuntu1~18.04.1 [11.6 kB]
Get:58 http://archive.ubuntu.com/ubuntu bionic-updates/main amd64 libquadmath0 amd64 8.3.0-6ubuntu1~18.04.1 [133 kB]
Get:59 http://archive.ubuntu.com/ubuntu bionic-updates/main amd64 libgcc-7-dev amd64 7.4.0-1ubuntu1~18.04.1 [2381 kB]
Get:60 http://archive.ubuntu.com/ubuntu bionic-updates/main amd64 gcc-7 amd64 7.4.0-1ubuntu1~18.04.1 [7463 kB]
Get:61 http://archive.ubuntu.com/ubuntu bionic-updates/main amd64 gcc amd64 4:7.4.0-1ubuntu2.3 [5184 B]
Get:62 http://archive.ubuntu.com/ubuntu bionic/main amd64 libc-dev-bin amd64 2.27-3ubuntu1 [71.8 kB]
Get:63 http://archive.ubuntu.com/ubuntu bionic-updates/main amd64 linux-libc-dev amd64 4.15.0-52.56 [1004 kB]
Get:64 http://archive.ubuntu.com/ubuntu bionic/main amd64 libc6-dev amd64 2.27-3ubuntu1 [2587 kB]
Get:65 http://archive.ubuntu.com/ubuntu bionic/main amd64 libsasl2-modules amd64 2.1.27~101-g0780600+dfsg-3ubuntu2 [48.7 kB]
Get:66 http://archive.ubuntu.com/ubuntu bionic/main amd64 make amd64 4.1-9.1ubuntu1 [154 kB]
Get:67 http://archive.ubuntu.com/ubuntu bionic/main amd64 manpages-dev all 4.15-1 [2217 kB] 
Fetched 45.2 MB in 13s (3366 kB/s)                                                          
debconf: delaying package configuration, since apt-utils is not installed
Selecting previously unselected package multiarch-support.
(Reading database ... 4859 files and directories currently installed.)
Preparing to unpack .../multiarch-support_2.27-3ubuntu1_amd64.deb ...
Unpacking multiarch-support (2.27-3ubuntu1) ...
Setting up multiarch-support (2.27-3ubuntu1) ...
Selecting previously unselected package liblzo2-2:amd64.
(Reading database ... 4862 files and directories currently installed.)
Preparing to unpack .../00-liblzo2-2_2.08-1.2_amd64.deb ...
Unpacking liblzo2-2:amd64 (2.08-1.2) ...
Selecting previously unselected package openssl.
Preparing to unpack .../01-openssl_1.1.1-1ubuntu2.1~18.04.3_amd64.deb ...
Unpacking openssl (1.1.1-1ubuntu2.1~18.04.3) ...
Selecting previously unselected package ca-certificates.
Preparing to unpack .../02-ca-certificates_20180409_all.deb ...
Unpacking ca-certificates (20180409) ...
Selecting previously unselected package libicu60:amd64.
Preparing to unpack .../03-libicu60_60.2-3ubuntu3_amd64.deb ...
Unpacking libicu60:amd64 (60.2-3ubuntu3) ...
Selecting previously unselected package libxml2:amd64.
Preparing to unpack .../04-libxml2_2.9.4+dfsg1-6.1ubuntu1.2_amd64.deb ...
Unpacking libxml2:amd64 (2.9.4+dfsg1-6.1ubuntu1.2) ...
Selecting previously unselected package krb5-locales.
Preparing to unpack .../05-krb5-locales_1.16-2ubuntu0.1_all.deb ...
Unpacking krb5-locales (1.16-2ubuntu0.1) ...
Selecting previously unselected package libkrb5support0:amd64.
Preparing to unpack .../06-libkrb5support0_1.16-2ubuntu0.1_amd64.deb ...
Unpacking libkrb5support0:amd64 (1.16-2ubuntu0.1) ...
Selecting previously unselected package libk5crypto3:amd64.
Preparing to unpack .../07-libk5crypto3_1.16-2ubuntu0.1_amd64.deb ...
Unpacking libk5crypto3:amd64 (1.16-2ubuntu0.1) ...
Selecting previously unselected package libkeyutils1:amd64.
Preparing to unpack .../08-libkeyutils1_1.5.9-9.2ubuntu2_amd64.deb ...
Unpacking libkeyutils1:amd64 (1.5.9-9.2ubuntu2) ...
Selecting previously unselected package libkrb5-3:amd64.
Preparing to unpack .../09-libkrb5-3_1.16-2ubuntu0.1_amd64.deb ...
Unpacking libkrb5-3:amd64 (1.16-2ubuntu0.1) ...
Selecting previously unselected package libgssapi-krb5-2:amd64.
Preparing to unpack .../10-libgssapi-krb5-2_1.16-2ubuntu0.1_amd64.deb ...
Unpacking libgssapi-krb5-2:amd64 (1.16-2ubuntu0.1) ...
Selecting previously unselected package libpsl5:amd64.
Preparing to unpack .../11-libpsl5_0.19.1-5build1_amd64.deb ...
Unpacking libpsl5:amd64 (0.19.1-5build1) ...
Selecting previously unselected package manpages.
Preparing to unpack .../12-manpages_4.15-1_all.deb ...
Unpacking manpages (4.15-1) ...
Selecting previously unselected package publicsuffix.
Preparing to unpack .../13-publicsuffix_20180223.1310-1_all.deb ...
Unpacking publicsuffix (20180223.1310-1) ...
Selecting previously unselected package binutils-common:amd64.
Preparing to unpack .../14-binutils-common_2.30-21ubuntu1~18.04.2_amd64.deb ...
Unpacking binutils-common:amd64 (2.30-21ubuntu1~18.04.2) ...
Selecting previously unselected package libbinutils:amd64.
Preparing to unpack .../15-libbinutils_2.30-21ubuntu1~18.04.2_amd64.deb ...
Unpacking libbinutils:amd64 (2.30-21ubuntu1~18.04.2) ...
Selecting previously unselected package binutils-x86-64-linux-gnu.
Preparing to unpack .../16-binutils-x86-64-linux-gnu_2.30-21ubuntu1~18.04.2_amd64.deb ...
Unpacking binutils-x86-64-linux-gnu (2.30-21ubuntu1~18.04.2) ...
Selecting previously unselected package binutils.
Preparing to unpack .../17-binutils_2.30-21ubuntu1~18.04.2_amd64.deb ...
Unpacking binutils (2.30-21ubuntu1~18.04.2) ...
Selecting previously unselected package cmake-data.
Preparing to unpack .../18-cmake-data_3.10.2-1ubuntu2_all.deb ...
Unpacking cmake-data (3.10.2-1ubuntu2) ...
Selecting previously unselected package libarchive13:amd64.
Preparing to unpack .../19-libarchive13_3.2.2-3.1ubuntu0.3_amd64.deb ...
Unpacking libarchive13:amd64 (3.2.2-3.1ubuntu0.3) ...
Selecting previously unselected package libroken18-heimdal:amd64.
Preparing to unpack .../20-libroken18-heimdal_7.5.0+dfsg-1_amd64.deb ...
Unpacking libroken18-heimdal:amd64 (7.5.0+dfsg-1) ...
Selecting previously unselected package libasn1-8-heimdal:amd64.
Preparing to unpack .../21-libasn1-8-heimdal_7.5.0+dfsg-1_amd64.deb ...
Unpacking libasn1-8-heimdal:amd64 (7.5.0+dfsg-1) ...
Selecting previously unselected package libheimbase1-heimdal:amd64.
Preparing to unpack .../22-libheimbase1-heimdal_7.5.0+dfsg-1_amd64.deb ...
Unpacking libheimbase1-heimdal:amd64 (7.5.0+dfsg-1) ...
Selecting previously unselected package libhcrypto4-heimdal:amd64.
Preparing to unpack .../23-libhcrypto4-heimdal_7.5.0+dfsg-1_amd64.deb ...
Unpacking libhcrypto4-heimdal:amd64 (7.5.0+dfsg-1) ...
Selecting previously unselected package libwind0-heimdal:amd64.
Preparing to unpack .../24-libwind0-heimdal_7.5.0+dfsg-1_amd64.deb ...
Unpacking libwind0-heimdal:amd64 (7.5.0+dfsg-1) ...
Selecting previously unselected package libhx509-5-heimdal:amd64.
Preparing to unpack .../25-libhx509-5-heimdal_7.5.0+dfsg-1_amd64.deb ...
Unpacking libhx509-5-heimdal:amd64 (7.5.0+dfsg-1) ...
Selecting previously unselected package libkrb5-26-heimdal:amd64.
Preparing to unpack .../26-libkrb5-26-heimdal_7.5.0+dfsg-1_amd64.deb ...
Unpacking libkrb5-26-heimdal:amd64 (7.5.0+dfsg-1) ...
Selecting previously unselected package libheimntlm0-heimdal:amd64.
Preparing to unpack .../27-libheimntlm0-heimdal_7.5.0+dfsg-1_amd64.deb ...
Unpacking libheimntlm0-heimdal:amd64 (7.5.0+dfsg-1) ...
Selecting previously unselected package libgssapi3-heimdal:amd64.
Preparing to unpack .../28-libgssapi3-heimdal_7.5.0+dfsg-1_amd64.deb ...
Unpacking libgssapi3-heimdal:amd64 (7.5.0+dfsg-1) ...
Selecting previously unselected package libsasl2-modules-db:amd64.
Preparing to unpack .../29-libsasl2-modules-db_2.1.27~101-g0780600+dfsg-3ubuntu2_amd64.deb ...
Unpacking libsasl2-modules-db:amd64 (2.1.27~101-g0780600+dfsg-3ubuntu2) ...
Selecting previously unselected package libsasl2-2:amd64.
Preparing to unpack .../30-libsasl2-2_2.1.27~101-g0780600+dfsg-3ubuntu2_amd64.deb ...
Unpacking libsasl2-2:amd64 (2.1.27~101-g0780600+dfsg-3ubuntu2) ...
Selecting previously unselected package libldap-common.
Preparing to unpack .../31-libldap-common_2.4.45+dfsg-1ubuntu1.2_all.deb ...
Unpacking libldap-common (2.4.45+dfsg-1ubuntu1.2) ...
Selecting previously unselected package libldap-2.4-2:amd64.
Preparing to unpack .../32-libldap-2.4-2_2.4.45+dfsg-1ubuntu1.2_amd64.deb ...
Unpacking libldap-2.4-2:amd64 (2.4.45+dfsg-1ubuntu1.2) ...
Selecting previously unselected package libnghttp2-14:amd64.
Preparing to unpack .../33-libnghttp2-14_1.30.0-1ubuntu1_amd64.deb ...
Unpacking libnghttp2-14:amd64 (1.30.0-1ubuntu1) ...
Selecting previously unselected package librtmp1:amd64.
Preparing to unpack .../34-librtmp1_2.4+20151223.gitfa8646d.1-1_amd64.deb ...
Unpacking librtmp1:amd64 (2.4+20151223.gitfa8646d.1-1) ...
Selecting previously unselected package libcurl4:amd64.
Preparing to unpack .../35-libcurl4_7.58.0-2ubuntu3.7_amd64.deb ...
Unpacking libcurl4:amd64 (7.58.0-2ubuntu3.7) ...
Selecting previously unselected package libjsoncpp1:amd64.
Preparing to unpack .../36-libjsoncpp1_1.7.4-3_amd64.deb ...
Unpacking libjsoncpp1:amd64 (1.7.4-3) ...
Selecting previously unselected package librhash0:amd64.
Preparing to unpack .../37-librhash0_1.3.6-2_amd64.deb ...
Unpacking librhash0:amd64 (1.3.6-2) ...
Selecting previously unselected package libuv1:amd64.
Preparing to unpack .../38-libuv1_1.18.0-3_amd64.deb ...
Unpacking libuv1:amd64 (1.18.0-3) ...
Selecting previously unselected package cmake.
Preparing to unpack .../39-cmake_3.10.2-1ubuntu2_amd64.deb ...
Unpacking cmake (3.10.2-1ubuntu2) ...
Selecting previously unselected package gcc-7-base:amd64.
Preparing to unpack .../40-gcc-7-base_7.4.0-1ubuntu1~18.04.1_amd64.deb ...
Unpacking gcc-7-base:amd64 (7.4.0-1ubuntu1~18.04.1) ...
Selecting previously unselected package libisl19:amd64.
Preparing to unpack .../41-libisl19_0.19-1_amd64.deb ...
Unpacking libisl19:amd64 (0.19-1) ...
Selecting previously unselected package libmpfr6:amd64.
Preparing to unpack .../42-libmpfr6_4.0.1-1_amd64.deb ...
Unpacking libmpfr6:amd64 (4.0.1-1) ...
Selecting previously unselected package libmpc3:amd64.
Preparing to unpack .../43-libmpc3_1.1.0-1_amd64.deb ...
Unpacking libmpc3:amd64 (1.1.0-1) ...
Selecting previously unselected package cpp-7.
Preparing to unpack .../44-cpp-7_7.4.0-1ubuntu1~18.04.1_amd64.deb ...
Unpacking cpp-7 (7.4.0-1ubuntu1~18.04.1) ...
Selecting previously unselected package cpp.
Preparing to unpack .../45-cpp_4%3a7.4.0-1ubuntu2.3_amd64.deb ...
Unpacking cpp (4:7.4.0-1ubuntu2.3) ...
Selecting previously unselected package libcc1-0:amd64.
Preparing to unpack .../46-libcc1-0_8.3.0-6ubuntu1~18.04.1_amd64.deb ...
Unpacking libcc1-0:amd64 (8.3.0-6ubuntu1~18.04.1) ...
Selecting previously unselected package libgomp1:amd64.
Preparing to unpack .../47-libgomp1_8.3.0-6ubuntu1~18.04.1_amd64.deb ...
Unpacking libgomp1:amd64 (8.3.0-6ubuntu1~18.04.1) ...
Selecting previously unselected package libitm1:amd64.
Preparing to unpack .../48-libitm1_8.3.0-6ubuntu1~18.04.1_amd64.deb ...
Unpacking libitm1:amd64 (8.3.0-6ubuntu1~18.04.1) ...
Selecting previously unselected package libatomic1:amd64.
Preparing to unpack .../49-libatomic1_8.3.0-6ubuntu1~18.04.1_amd64.deb ...
Unpacking libatomic1:amd64 (8.3.0-6ubuntu1~18.04.1) ...
Selecting previously unselected package libasan4:amd64.
Preparing to unpack .../50-libasan4_7.4.0-1ubuntu1~18.04.1_amd64.deb ...
Unpacking libasan4:amd64 (7.4.0-1ubuntu1~18.04.1) ...
Selecting previously unselected package liblsan0:amd64.
Preparing to unpack .../51-liblsan0_8.3.0-6ubuntu1~18.04.1_amd64.deb ...
Unpacking liblsan0:amd64 (8.3.0-6ubuntu1~18.04.1) ...
Selecting previously unselected package libtsan0:amd64.
Preparing to unpack .../52-libtsan0_8.3.0-6ubuntu1~18.04.1_amd64.deb ...
Unpacking libtsan0:amd64 (8.3.0-6ubuntu1~18.04.1) ...
Selecting previously unselected package libubsan0:amd64.
Preparing to unpack .../53-libubsan0_7.4.0-1ubuntu1~18.04.1_amd64.deb ...
Unpacking libubsan0:amd64 (7.4.0-1ubuntu1~18.04.1) ...
Selecting previously unselected package libcilkrts5:amd64.
Preparing to unpack .../54-libcilkrts5_7.4.0-1ubuntu1~18.04.1_amd64.deb ...
Unpacking libcilkrts5:amd64 (7.4.0-1ubuntu1~18.04.1) ...
Selecting previously unselected package libmpx2:amd64.
Preparing to unpack .../55-libmpx2_8.3.0-6ubuntu1~18.04.1_amd64.deb ...
Unpacking libmpx2:amd64 (8.3.0-6ubuntu1~18.04.1) ...
Selecting previously unselected package libquadmath0:amd64.
Preparing to unpack .../56-libquadmath0_8.3.0-6ubuntu1~18.04.1_amd64.deb ...
Unpacking libquadmath0:amd64 (8.3.0-6ubuntu1~18.04.1) ...
Selecting previously unselected package libgcc-7-dev:amd64.
Preparing to unpack .../57-libgcc-7-dev_7.4.0-1ubuntu1~18.04.1_amd64.deb ...
Unpacking libgcc-7-dev:amd64 (7.4.0-1ubuntu1~18.04.1) ...
Selecting previously unselected package gcc-7.
Preparing to unpack .../58-gcc-7_7.4.0-1ubuntu1~18.04.1_amd64.deb ...
Unpacking gcc-7 (7.4.0-1ubuntu1~18.04.1) ...
Selecting previously unselected package gcc.
Preparing to unpack .../59-gcc_4%3a7.4.0-1ubuntu2.3_amd64.deb ...
Unpacking gcc (4:7.4.0-1ubuntu2.3) ...
Selecting previously unselected package libc-dev-bin.
Preparing to unpack .../60-libc-dev-bin_2.27-3ubuntu1_amd64.deb ...
Unpacking libc-dev-bin (2.27-3ubuntu1) ...
Selecting previously unselected package linux-libc-dev:amd64.
Preparing to unpack .../61-linux-libc-dev_4.15.0-52.56_amd64.deb ...
Unpacking linux-libc-dev:amd64 (4.15.0-52.56) ...
Selecting previously unselected package libc6-dev:amd64.
Preparing to unpack .../62-libc6-dev_2.27-3ubuntu1_amd64.deb ...
Unpacking libc6-dev:amd64 (2.27-3ubuntu1) ...
Selecting previously unselected package libsasl2-modules:amd64.
Preparing to unpack .../63-libsasl2-modules_2.1.27~101-g0780600+dfsg-3ubuntu2_amd64.deb ...
Unpacking libsasl2-modules:amd64 (2.1.27~101-g0780600+dfsg-3ubuntu2) ...
Selecting previously unselected package make.
Preparing to unpack .../64-make_4.1-9.1ubuntu1_amd64.deb ...
Unpacking make (4.1-9.1ubuntu1) ...
Selecting previously unselected package manpages-dev.
Preparing to unpack .../65-manpages-dev_4.15-1_all.deb ...
Unpacking manpages-dev (4.15-1) ...
Setting up libquadmath0:amd64 (8.3.0-6ubuntu1~18.04.1) ...
Setting up libgomp1:amd64 (8.3.0-6ubuntu1~18.04.1) ...
Setting up libatomic1:amd64 (8.3.0-6ubuntu1~18.04.1) ...
Setting up manpages (4.15-1) ...
Setting up libicu60:amd64 (60.2-3ubuntu3) ...
Setting up libcc1-0:amd64 (8.3.0-6ubuntu1~18.04.1) ...
Setting up make (4.1-9.1ubuntu1) ...
Setting up libnghttp2-14:amd64 (1.30.0-1ubuntu1) ...
Setting up libldap-common (2.4.45+dfsg-1ubuntu1.2) ...
Setting up libuv1:amd64 (1.18.0-3) ...
Setting up libpsl5:amd64 (0.19.1-5build1) ...
Setting up libtsan0:amd64 (8.3.0-6ubuntu1~18.04.1) ...
Setting up libsasl2-modules-db:amd64 (2.1.27~101-g0780600+dfsg-3ubuntu2) ...
Setting up linux-libc-dev:amd64 (4.15.0-52.56) ...
Setting up libmpfr6:amd64 (4.0.1-1) ...
Setting up libsasl2-2:amd64 (2.1.27~101-g0780600+dfsg-3ubuntu2) ...
Setting up cmake-data (3.10.2-1ubuntu2) ...
Setting up libroken18-heimdal:amd64 (7.5.0+dfsg-1) ...
Setting up librtmp1:amd64 (2.4+20151223.gitfa8646d.1-1) ...
Setting up libkrb5support0:amd64 (1.16-2ubuntu0.1) ...
Setting up libxml2:amd64 (2.9.4+dfsg1-6.1ubuntu1.2) ...
Setting up librhash0:amd64 (1.3.6-2) ...
Setting up liblsan0:amd64 (8.3.0-6ubuntu1~18.04.1) ...
Setting up gcc-7-base:amd64 (7.4.0-1ubuntu1~18.04.1) ...
Setting up binutils-common:amd64 (2.30-21ubuntu1~18.04.2) ...
Setting up libmpx2:amd64 (8.3.0-6ubuntu1~18.04.1) ...
Setting up krb5-locales (1.16-2ubuntu0.1) ...
Processing triggers for libc-bin (2.27-3ubuntu1) ...
Setting up publicsuffix (20180223.1310-1) ...
Setting up libheimbase1-heimdal:amd64 (7.5.0+dfsg-1) ...
Setting up openssl (1.1.1-1ubuntu2.1~18.04.3) ...
Setting up libmpc3:amd64 (1.1.0-1) ...
Setting up libc-dev-bin (2.27-3ubuntu1) ...
Setting up libkeyutils1:amd64 (1.5.9-9.2ubuntu2) ...
Setting up libsasl2-modules:amd64 (2.1.27~101-g0780600+dfsg-3ubuntu2) ...
Setting up ca-certificates (20180409) ...
debconf: unable to initialize frontend: Dialog
debconf: (No usable dialog-like program is installed, so the dialog based frontend cannot be used. at /usr/share/perl5/Debconf/FrontEnd/Dialog.pm line 76.)
debconf: falling back to frontend: Readline
debconf: unable to initialize frontend: Readline
debconf: (Can't locate Term/ReadLine.pm in @INC (you may need to install the Term::ReadLine module) (@INC contains: /etc/perl /usr/local/lib/x86_64-linux-gnu/perl/5.26.1 /usr/local/share/perl/5.26.1 /usr/lib/x86_64-linux-gnu/perl5/5.26 /usr/share/perl5 /usr/lib/x86_64-linux-gnu/perl/5.26 /usr/share/perl/5.26 /usr/local/lib/site_perl /usr/lib/x86_64-linux-gnu/perl-base) at /usr/share/perl5/Debconf/FrontEnd/Readline.pm line 7.)
debconf: falling back to frontend: Teletype
Updating certificates in /etc/ssl/certs...
133 added, 0 removed; done.
Setting up manpages-dev (4.15-1) ...
Setting up libc6-dev:amd64 (2.27-3ubuntu1) ...
Setting up libitm1:amd64 (8.3.0-6ubuntu1~18.04.1) ...
Setting up liblzo2-2:amd64 (2.08-1.2) ...
Setting up libisl19:amd64 (0.19-1) ...
Setting up libjsoncpp1:amd64 (1.7.4-3) ...
Setting up libk5crypto3:amd64 (1.16-2ubuntu0.1) ...
Setting up libwind0-heimdal:amd64 (7.5.0+dfsg-1) ...
Setting up libasan4:amd64 (7.4.0-1ubuntu1~18.04.1) ...
Setting up libbinutils:amd64 (2.30-21ubuntu1~18.04.2) ...
Setting up libarchive13:amd64 (3.2.2-3.1ubuntu0.3) ...
Setting up libcilkrts5:amd64 (7.4.0-1ubuntu1~18.04.1) ...
Setting up libasn1-8-heimdal:amd64 (7.5.0+dfsg-1) ...
Setting up libubsan0:amd64 (7.4.0-1ubuntu1~18.04.1) ...
Setting up libhcrypto4-heimdal:amd64 (7.5.0+dfsg-1) ...
Setting up libhx509-5-heimdal:amd64 (7.5.0+dfsg-1) ...
Setting up libgcc-7-dev:amd64 (7.4.0-1ubuntu1~18.04.1) ...
Setting up cpp-7 (7.4.0-1ubuntu1~18.04.1) ...
Setting up libkrb5-3:amd64 (1.16-2ubuntu0.1) ...
Setting up libkrb5-26-heimdal:amd64 (7.5.0+dfsg-1) ...
Setting up libheimntlm0-heimdal:amd64 (7.5.0+dfsg-1) ...
Setting up binutils-x86-64-linux-gnu (2.30-21ubuntu1~18.04.2) ...
Setting up cpp (4:7.4.0-1ubuntu2.3) ...
Setting up libgssapi-krb5-2:amd64 (1.16-2ubuntu0.1) ...
Setting up binutils (2.30-21ubuntu1~18.04.2) ...
Setting up libgssapi3-heimdal:amd64 (7.5.0+dfsg-1) ...
Setting up gcc-7 (7.4.0-1ubuntu1~18.04.1) ...
Setting up gcc (4:7.4.0-1ubuntu2.3) ...
Setting up libldap-2.4-2:amd64 (2.4.45+dfsg-1ubuntu1.2) ...
Setting up libcurl4:amd64 (7.58.0-2ubuntu3.7) ...
Setting up cmake (3.10.2-1ubuntu2) ...
Processing triggers for libc-bin (2.27-3ubuntu1) ...
Processing triggers for ca-certificates (20180409) ...
Updating certificates in /etc/ssl/certs...
0 added, 0 removed; done.
Running hooks in /etc/ca-certificates/update.d...
done.

root@02b32b9272ce:/# apt install python3-pip
Reading package lists... Done
Building dependency tree       
Reading state information... Done
The following additional packages will be installed:
  build-essential dbus dh-python dirmngr dpkg-dev fakeroot g++ g++-7 gir1.2-glib-2.0 gnupg
  gnupg-l10n gnupg-utils gpg gpg-agent gpg-wks-client gpg-wks-server gpgconf gpgsm
  libalgorithm-diff-perl libalgorithm-diff-xs-perl libalgorithm-merge-perl libapparmor1
  libassuan0 libdbus-1-3 libdpkg-perl libexpat1-dev libfakeroot libfile-fcntllock-perl
  libgdbm-compat4 libgdbm5 libgirepository-1.0-1 libglib2.0-0 libglib2.0-data libksba8
  liblocale-gettext-perl libnpth0 libperl5.26 libpython3-dev libpython3.6 libpython3.6-dev
  libstdc++-7-dev netbase patch perl perl-modules-5.26 pinentry-curses python-pip-whl
  python3-asn1crypto python3-cffi-backend python3-crypto python3-cryptography python3-dbus
  python3-dev python3-distutils python3-gi python3-idna python3-keyring
  python3-keyrings.alt python3-lib2to3 python3-pkg-resources python3-secretstorage
  python3-setuptools python3-six python3-wheel python3-xdg python3.6-dev shared-mime-info
  xdg-user-dirs
Suggested packages:
  default-dbus-session-bus | dbus-session-bus dbus-user-session libpam-systemd
  pinentry-gnome3 tor debian-keyring g++-multilib g++-7-multilib gcc-7-doc libstdc++6-7-dbg
  parcimonie xloadimage scdaemon git bzr gdbm-l10n libstdc++-7-doc ed diffutils-doc
  perl-doc libterm-readline-gnu-perl | libterm-readline-perl-perl pinentry-doc
  python-crypto-doc python-cryptography-doc python3-cryptography-vectors python-dbus-doc
  python3-dbus-dbg gnome-keyring libkf5wallet-bin gir1.2-gnomekeyring-1.0
  python-secretstorage-doc python-setuptools-doc
The following NEW packages will be installed:
  build-essential dbus dh-python dirmngr dpkg-dev fakeroot g++ g++-7 gir1.2-glib-2.0 gnupg
  gnupg-l10n gnupg-utils gpg gpg-agent gpg-wks-client gpg-wks-server gpgconf gpgsm
  libalgorithm-diff-perl libalgorithm-diff-xs-perl libalgorithm-merge-perl libapparmor1
  libassuan0 libdbus-1-3 libdpkg-perl libexpat1-dev libfakeroot libfile-fcntllock-perl
  libgdbm-compat4 libgdbm5 libgirepository-1.0-1 libglib2.0-0 libglib2.0-data libksba8
  liblocale-gettext-perl libnpth0 libperl5.26 libpython3-dev libpython3.6 libpython3.6-dev
  libstdc++-7-dev netbase patch perl perl-modules-5.26 pinentry-curses python-pip-whl
  python3-asn1crypto python3-cffi-backend python3-crypto python3-cryptography python3-dbus
  python3-dev python3-distutils python3-gi python3-idna python3-keyring
  python3-keyrings.alt python3-lib2to3 python3-pip python3-pkg-resources
  python3-secretstorage python3-setuptools python3-six python3-wheel python3-xdg
  python3.6-dev shared-mime-info xdg-user-dirs
0 upgraded, 69 newly installed, 0 to remove and 0 not upgraded.
Need to get 71.4 MB of archives.
After this operation, 198 MB of additional disk space will be used.
Do you want to continue? [Y/n] y
Get:1 http://archive.ubuntu.com/ubuntu bionic/main amd64 liblocale-gettext-perl amd64 1.07-3build2 [16.6 kB]
Get:2 http://archive.ubuntu.com/ubuntu bionic-updates/main amd64 perl-modules-5.26 all 5.26.1-6ubuntu0.3 [2763 kB]
Get:3 http://archive.ubuntu.com/ubuntu bionic/main amd64 libgdbm5 amd64 1.14.1-6 [26.0 kB]
Get:4 http://archive.ubuntu.com/ubuntu bionic/main amd64 libgdbm-compat4 amd64 1.14.1-6 [6084 B]
Get:5 http://archive.ubuntu.com/ubuntu bionic-updates/main amd64 libperl5.26 amd64 5.26.1-6ubuntu0.3 [3527 kB]
Get:6 http://archive.ubuntu.com/ubuntu bionic-updates/main amd64 perl amd64 5.26.1-6ubuntu0.3 [201 kB]
Get:7 http://archive.ubuntu.com/ubuntu bionic-updates/main amd64 libapparmor1 amd64 2.12-4ubuntu5.1 [31.3 kB]
Get:8 http://archive.ubuntu.com/ubuntu bionic-updates/main amd64 libdbus-1-3 amd64 1.12.2-1ubuntu1.1 [175 kB]
Get:9 http://archive.ubuntu.com/ubuntu bionic-updates/main amd64 dbus amd64 1.12.2-1ubuntu1.1 [150 kB]
Get:10 http://archive.ubuntu.com/ubuntu bionic-updates/main amd64 libglib2.0-0 amd64 2.56.4-0ubuntu0.18.04.3 [1169 kB]
Get:11 http://archive.ubuntu.com/ubuntu bionic/main amd64 libgirepository-1.0-1 amd64 1.56.1-1 [82.0 kB]
Get:12 http://archive.ubuntu.com/ubuntu bionic/main amd64 gir1.2-glib-2.0 amd64 1.56.1-1 [131 kB]
Get:13 http://archive.ubuntu.com/ubuntu bionic-updates/main amd64 libglib2.0-data all 2.56.4-0ubuntu0.18.04.3 [4608 B]
Get:14 http://archive.ubuntu.com/ubuntu bionic/main amd64 netbase all 5.4 [12.7 kB]
Get:15 http://archive.ubuntu.com/ubuntu bionic/main amd64 python3-dbus amd64 1.2.6-1 [89.9 kB]
Get:16 http://archive.ubuntu.com/ubuntu bionic-updates/main amd64 python3-gi amd64 3.26.1-2ubuntu1 [153 kB]
Get:17 http://archive.ubuntu.com/ubuntu bionic/main amd64 shared-mime-info amd64 1.9-2 [426 kB]
Get:18 http://archive.ubuntu.com/ubuntu bionic/main amd64 xdg-user-dirs amd64 0.17-1ubuntu1 [48.0 kB]
Get:19 http://archive.ubuntu.com/ubuntu bionic-updates/main amd64 libstdc++-7-dev amd64 7.4.0-1ubuntu1~18.04.1 [1468 kB]
Get:20 http://archive.ubuntu.com/ubuntu bionic-updates/main amd64 g++-7 amd64 7.4.0-1ubuntu1~18.04.1 [7574 kB]
Get:21 http://archive.ubuntu.com/ubuntu bionic-updates/main amd64 g++ amd64 4:7.4.0-1ubuntu2.3 [1568 B]
Get:22 http://archive.ubuntu.com/ubuntu bionic-updates/main amd64 libdpkg-perl all 1.19.0.5ubuntu2.1 [211 kB]
Get:23 http://archive.ubuntu.com/ubuntu bionic/main amd64 patch amd64 2.7.6-2ubuntu1 [102 kB]
Get:24 http://archive.ubuntu.com/ubuntu bionic-updates/main amd64 dpkg-dev all 1.19.0.5ubuntu2.1 [608 kB]
Get:25 http://archive.ubuntu.com/ubuntu bionic/main amd64 build-essential amd64 12.4ubuntu1 [4758 B]
Get:26 http://archive.ubuntu.com/ubuntu bionic-updates/main amd64 python3-lib2to3 all 3.6.8-1~18.04 [76.5 kB]
Get:27 http://archive.ubuntu.com/ubuntu bionic-updates/main amd64 python3-distutils all 3.6.8-1~18.04 [141 kB]
Get:28 http://archive.ubuntu.com/ubuntu bionic/main amd64 dh-python all 3.20180325ubuntu2 [89.2 kB]
Get:29 http://archive.ubuntu.com/ubuntu bionic/main amd64 libassuan0 amd64 2.5.1-2 [35.0 kB]
Get:30 http://archive.ubuntu.com/ubuntu bionic-updates/main amd64 gpgconf amd64 2.2.4-1ubuntu1.2 [123 kB]
Get:31 http://archive.ubuntu.com/ubuntu bionic/main amd64 libksba8 amd64 1.3.5-2 [92.6 kB]  
Get:32 http://archive.ubuntu.com/ubuntu bionic/main amd64 libnpth0 amd64 1.5-3 [7668 B]     
Get:33 http://archive.ubuntu.com/ubuntu bionic-updates/main amd64 dirmngr amd64 2.2.4-1ubuntu1.2 [316 kB]
Get:34 http://archive.ubuntu.com/ubuntu bionic/main amd64 libfakeroot amd64 1.22-2ubuntu1 [25.9 kB]
Get:35 http://archive.ubuntu.com/ubuntu bionic/main amd64 fakeroot amd64 1.22-2ubuntu1 [62.3 kB]
Get:36 http://archive.ubuntu.com/ubuntu bionic-updates/main amd64 gnupg-l10n all 2.2.4-1ubuntu1.2 [49.6 kB]
Get:37 http://archive.ubuntu.com/ubuntu bionic-updates/main amd64 gnupg-utils amd64 2.2.4-1ubuntu1.2 [127 kB]
Get:38 http://archive.ubuntu.com/ubuntu bionic-updates/main amd64 gpg amd64 2.2.4-1ubuntu1.2 [467 kB]
Get:39 http://archive.ubuntu.com/ubuntu bionic/main amd64 pinentry-curses amd64 1.1.0-1 [35.8 kB]
Get:40 http://archive.ubuntu.com/ubuntu bionic-updates/main amd64 gpg-agent amd64 2.2.4-1ubuntu1.2 [227 kB]
Get:41 http://archive.ubuntu.com/ubuntu bionic-updates/main amd64 gpg-wks-client amd64 2.2.4-1ubuntu1.2 [91.9 kB]
Get:42 http://archive.ubuntu.com/ubuntu bionic-updates/main amd64 gpg-wks-server amd64 2.2.4-1ubuntu1.2 [84.9 kB]
Get:43 http://archive.ubuntu.com/ubuntu bionic-updates/main amd64 gpgsm amd64 2.2.4-1ubuntu1.2 [215 kB]
Get:44 http://archive.ubuntu.com/ubuntu bionic-updates/main amd64 gnupg amd64 2.2.4-1ubuntu1.2 [249 kB]
Get:45 http://archive.ubuntu.com/ubuntu bionic/main amd64 libalgorithm-diff-perl all 1.19.03-1 [47.6 kB]
Get:46 http://archive.ubuntu.com/ubuntu bionic/main amd64 libalgorithm-diff-xs-perl amd64 0.04-5 [11.1 kB]
Get:47 http://archive.ubuntu.com/ubuntu bionic/main amd64 libalgorithm-merge-perl all 0.08-3 [12.0 kB]
Get:48 http://archive.ubuntu.com/ubuntu bionic/main amd64 libexpat1-dev amd64 2.2.5-3 [122 kB]
Get:49 http://archive.ubuntu.com/ubuntu bionic/main amd64 libfile-fcntllock-perl amd64 0.22-3build2 [33.2 kB]
Get:50 http://archive.ubuntu.com/ubuntu bionic-updates/main amd64 libpython3.6 amd64 3.6.8-1~18.04.1 [1418 kB]
Get:51 http://archive.ubuntu.com/ubuntu bionic-updates/main amd64 libpython3.6-dev amd64 3.6.8-1~18.04.1 [44.8 MB]
Get:52 http://archive.ubuntu.com/ubuntu bionic-updates/main amd64 libpython3-dev amd64 3.6.7-1~18.04 [7328 B]
Get:53 http://archive.ubuntu.com/ubuntu bionic-updates/universe amd64 python-pip-whl all 9.0.1-2.3~ubuntu1.18.04.1 [1653 kB]
Get:54 http://archive.ubuntu.com/ubuntu bionic/main amd64 python3-asn1crypto all 0.24.0-1 [72.8 kB]
Get:55 http://archive.ubuntu.com/ubuntu bionic/main amd64 python3-cffi-backend amd64 1.11.5-1 [64.6 kB]
Get:56 http://archive.ubuntu.com/ubuntu bionic/main amd64 python3-crypto amd64 2.6.1-8ubuntu2 [244 kB]
Get:57 http://archive.ubuntu.com/ubuntu bionic/main amd64 python3-idna all 2.6-1 [32.5 kB]  
Get:58 http://archive.ubuntu.com/ubuntu bionic/main amd64 python3-six all 1.11.0-2 [11.4 kB]
Get:59 http://archive.ubuntu.com/ubuntu bionic-updates/main amd64 python3-cryptography amd64 2.1.4-1ubuntu1.3 [221 kB]
Get:60 http://archive.ubuntu.com/ubuntu bionic-updates/main amd64 python3.6-dev amd64 3.6.8-1~18.04.1 [508 kB]
Get:61 http://archive.ubuntu.com/ubuntu bionic-updates/main amd64 python3-dev amd64 3.6.7-1~18.04 [1288 B]
Get:62 http://archive.ubuntu.com/ubuntu bionic/main amd64 python3-secretstorage all 2.3.1-2 [12.1 kB]
Get:63 http://archive.ubuntu.com/ubuntu bionic/main amd64 python3-keyring all 10.6.0-1 [26.7 kB]
Get:64 http://archive.ubuntu.com/ubuntu bionic/main amd64 python3-keyrings.alt all 3.0-1 [16.6 kB]
Get:65 http://archive.ubuntu.com/ubuntu bionic-updates/universe amd64 python3-pip all 9.0.1-2.3~ubuntu1.18.04.1 [114 kB]
Get:66 http://archive.ubuntu.com/ubuntu bionic/main amd64 python3-pkg-resources all 39.0.1-2 [98.8 kB]
Get:67 http://archive.ubuntu.com/ubuntu bionic/main amd64 python3-setuptools all 39.0.1-2 [248 kB]
Get:68 http://archive.ubuntu.com/ubuntu bionic/universe amd64 python3-wheel all 0.30.0-0.2 [36.5 kB]
Get:69 http://archive.ubuntu.com/ubuntu bionic/main amd64 python3-xdg all 0.25-4ubuntu1 [31.4 kB]
Fetched 71.4 MB in 22s (3203 kB/s)                                                          
debconf: delaying package configuration, since apt-utils is not installed
Selecting previously unselected package liblocale-gettext-perl.
(Reading database ... 12277 files and directories currently installed.)
Preparing to unpack .../00-liblocale-gettext-perl_1.07-3build2_amd64.deb ...
Unpacking liblocale-gettext-perl (1.07-3build2) ...
Selecting previously unselected package perl-modules-5.26.
Preparing to unpack .../01-perl-modules-5.26_5.26.1-6ubuntu0.3_all.deb ...
Unpacking perl-modules-5.26 (5.26.1-6ubuntu0.3) ...
Selecting previously unselected package libgdbm5:amd64.
Preparing to unpack .../02-libgdbm5_1.14.1-6_amd64.deb ...
Unpacking libgdbm5:amd64 (1.14.1-6) ...
Selecting previously unselected package libgdbm-compat4:amd64.
Preparing to unpack .../03-libgdbm-compat4_1.14.1-6_amd64.deb ...
Unpacking libgdbm-compat4:amd64 (1.14.1-6) ...
Selecting previously unselected package libperl5.26:amd64.
Preparing to unpack .../04-libperl5.26_5.26.1-6ubuntu0.3_amd64.deb ...
Unpacking libperl5.26:amd64 (5.26.1-6ubuntu0.3) ...
Selecting previously unselected package perl.
Preparing to unpack .../05-perl_5.26.1-6ubuntu0.3_amd64.deb ...
Unpacking perl (5.26.1-6ubuntu0.3) ...
Selecting previously unselected package libapparmor1:amd64.
Preparing to unpack .../06-libapparmor1_2.12-4ubuntu5.1_amd64.deb ...
Unpacking libapparmor1:amd64 (2.12-4ubuntu5.1) ...
Selecting previously unselected package libdbus-1-3:amd64.
Preparing to unpack .../07-libdbus-1-3_1.12.2-1ubuntu1.1_amd64.deb ...
Unpacking libdbus-1-3:amd64 (1.12.2-1ubuntu1.1) ...
Selecting previously unselected package dbus.
Preparing to unpack .../08-dbus_1.12.2-1ubuntu1.1_amd64.deb ...
Unpacking dbus (1.12.2-1ubuntu1.1) ...
Selecting previously unselected package libglib2.0-0:amd64.
Preparing to unpack .../09-libglib2.0-0_2.56.4-0ubuntu0.18.04.3_amd64.deb ...
Unpacking libglib2.0-0:amd64 (2.56.4-0ubuntu0.18.04.3) ...
Selecting previously unselected package libgirepository-1.0-1:amd64.
Preparing to unpack .../10-libgirepository-1.0-1_1.56.1-1_amd64.deb ...
Unpacking libgirepository-1.0-1:amd64 (1.56.1-1) ...
Selecting previously unselected package gir1.2-glib-2.0:amd64.
Preparing to unpack .../11-gir1.2-glib-2.0_1.56.1-1_amd64.deb ...
Unpacking gir1.2-glib-2.0:amd64 (1.56.1-1) ...
Selecting previously unselected package libglib2.0-data.
Preparing to unpack .../12-libglib2.0-data_2.56.4-0ubuntu0.18.04.3_all.deb ...
Unpacking libglib2.0-data (2.56.4-0ubuntu0.18.04.3) ...
Selecting previously unselected package netbase.
Preparing to unpack .../13-netbase_5.4_all.deb ...
Unpacking netbase (5.4) ...
Selecting previously unselected package python3-dbus.
Preparing to unpack .../14-python3-dbus_1.2.6-1_amd64.deb ...
Unpacking python3-dbus (1.2.6-1) ...
Selecting previously unselected package python3-gi.
Preparing to unpack .../15-python3-gi_3.26.1-2ubuntu1_amd64.deb ...
Unpacking python3-gi (3.26.1-2ubuntu1) ...
Selecting previously unselected package shared-mime-info.
Preparing to unpack .../16-shared-mime-info_1.9-2_amd64.deb ...
Unpacking shared-mime-info (1.9-2) ...
Selecting previously unselected package xdg-user-dirs.
Preparing to unpack .../17-xdg-user-dirs_0.17-1ubuntu1_amd64.deb ...
Unpacking xdg-user-dirs (0.17-1ubuntu1) ...
Selecting previously unselected package libstdc++-7-dev:amd64.
Preparing to unpack .../18-libstdc++-7-dev_7.4.0-1ubuntu1~18.04.1_amd64.deb ...
Unpacking libstdc++-7-dev:amd64 (7.4.0-1ubuntu1~18.04.1) ...
Selecting previously unselected package g++-7.
Preparing to unpack .../19-g++-7_7.4.0-1ubuntu1~18.04.1_amd64.deb ...
Unpacking g++-7 (7.4.0-1ubuntu1~18.04.1) ...
Selecting previously unselected package g++.
Preparing to unpack .../20-g++_4%3a7.4.0-1ubuntu2.3_amd64.deb ...
Unpacking g++ (4:7.4.0-1ubuntu2.3) ...
Selecting previously unselected package libdpkg-perl.
Preparing to unpack .../21-libdpkg-perl_1.19.0.5ubuntu2.1_all.deb ...
Unpacking libdpkg-perl (1.19.0.5ubuntu2.1) ...
Selecting previously unselected package patch.
Preparing to unpack .../22-patch_2.7.6-2ubuntu1_amd64.deb ...
Unpacking patch (2.7.6-2ubuntu1) ...
Selecting previously unselected package dpkg-dev.
Preparing to unpack .../23-dpkg-dev_1.19.0.5ubuntu2.1_all.deb ...
Unpacking dpkg-dev (1.19.0.5ubuntu2.1) ...
Selecting previously unselected package build-essential.
Preparing to unpack .../24-build-essential_12.4ubuntu1_amd64.deb ...
Unpacking build-essential (12.4ubuntu1) ...
Selecting previously unselected package python3-lib2to3.
Preparing to unpack .../25-python3-lib2to3_3.6.8-1~18.04_all.deb ...
Unpacking python3-lib2to3 (3.6.8-1~18.04) ...
Selecting previously unselected package python3-distutils.
Preparing to unpack .../26-python3-distutils_3.6.8-1~18.04_all.deb ...
Unpacking python3-distutils (3.6.8-1~18.04) ...
Selecting previously unselected package dh-python.
Preparing to unpack .../27-dh-python_3.20180325ubuntu2_all.deb ...
Unpacking dh-python (3.20180325ubuntu2) ...
Selecting previously unselected package libassuan0:amd64.
Preparing to unpack .../28-libassuan0_2.5.1-2_amd64.deb ...
Unpacking libassuan0:amd64 (2.5.1-2) ...
Selecting previously unselected package gpgconf.
Preparing to unpack .../29-gpgconf_2.2.4-1ubuntu1.2_amd64.deb ...
Unpacking gpgconf (2.2.4-1ubuntu1.2) ...
Selecting previously unselected package libksba8:amd64.
Preparing to unpack .../30-libksba8_1.3.5-2_amd64.deb ...
Unpacking libksba8:amd64 (1.3.5-2) ...
Selecting previously unselected package libnpth0:amd64.
Preparing to unpack .../31-libnpth0_1.5-3_amd64.deb ...
Unpacking libnpth0:amd64 (1.5-3) ...
Selecting previously unselected package dirmngr.
Preparing to unpack .../32-dirmngr_2.2.4-1ubuntu1.2_amd64.deb ...
Unpacking dirmngr (2.2.4-1ubuntu1.2) ...
Selecting previously unselected package libfakeroot:amd64.
Preparing to unpack .../33-libfakeroot_1.22-2ubuntu1_amd64.deb ...
Unpacking libfakeroot:amd64 (1.22-2ubuntu1) ...
Selecting previously unselected package fakeroot.
Preparing to unpack .../34-fakeroot_1.22-2ubuntu1_amd64.deb ...
Unpacking fakeroot (1.22-2ubuntu1) ...
Selecting previously unselected package gnupg-l10n.
Preparing to unpack .../35-gnupg-l10n_2.2.4-1ubuntu1.2_all.deb ...
Unpacking gnupg-l10n (2.2.4-1ubuntu1.2) ...
Selecting previously unselected package gnupg-utils.
Preparing to unpack .../36-gnupg-utils_2.2.4-1ubuntu1.2_amd64.deb ...
Unpacking gnupg-utils (2.2.4-1ubuntu1.2) ...
Selecting previously unselected package gpg.
Preparing to unpack .../37-gpg_2.2.4-1ubuntu1.2_amd64.deb ...
Unpacking gpg (2.2.4-1ubuntu1.2) ...
Selecting previously unselected package pinentry-curses.
Preparing to unpack .../38-pinentry-curses_1.1.0-1_amd64.deb ...
Unpacking pinentry-curses (1.1.0-1) ...
Selecting previously unselected package gpg-agent.
Preparing to unpack .../39-gpg-agent_2.2.4-1ubuntu1.2_amd64.deb ...
Unpacking gpg-agent (2.2.4-1ubuntu1.2) ...
Selecting previously unselected package gpg-wks-client.
Preparing to unpack .../40-gpg-wks-client_2.2.4-1ubuntu1.2_amd64.deb ...
Unpacking gpg-wks-client (2.2.4-1ubuntu1.2) ...
Selecting previously unselected package gpg-wks-server.
Preparing to unpack .../41-gpg-wks-server_2.2.4-1ubuntu1.2_amd64.deb ...
Unpacking gpg-wks-server (2.2.4-1ubuntu1.2) ...
Selecting previously unselected package gpgsm.
Preparing to unpack .../42-gpgsm_2.2.4-1ubuntu1.2_amd64.deb ...
Unpacking gpgsm (2.2.4-1ubuntu1.2) ...
Selecting previously unselected package gnupg.
Preparing to unpack .../43-gnupg_2.2.4-1ubuntu1.2_amd64.deb ...
Unpacking gnupg (2.2.4-1ubuntu1.2) ...
Selecting previously unselected package libalgorithm-diff-perl.
Preparing to unpack .../44-libalgorithm-diff-perl_1.19.03-1_all.deb ...
Unpacking libalgorithm-diff-perl (1.19.03-1) ...
Selecting previously unselected package libalgorithm-diff-xs-perl.
Preparing to unpack .../45-libalgorithm-diff-xs-perl_0.04-5_amd64.deb ...
Unpacking libalgorithm-diff-xs-perl (0.04-5) ...
Selecting previously unselected package libalgorithm-merge-perl.
Preparing to unpack .../46-libalgorithm-merge-perl_0.08-3_all.deb ...
Unpacking libalgorithm-merge-perl (0.08-3) ...
Selecting previously unselected package libexpat1-dev:amd64.
Preparing to unpack .../47-libexpat1-dev_2.2.5-3_amd64.deb ...
Unpacking libexpat1-dev:amd64 (2.2.5-3) ...
Selecting previously unselected package libfile-fcntllock-perl.
Preparing to unpack .../48-libfile-fcntllock-perl_0.22-3build2_amd64.deb ...
Unpacking libfile-fcntllock-perl (0.22-3build2) ...
Selecting previously unselected package libpython3.6:amd64.
Preparing to unpack .../49-libpython3.6_3.6.8-1~18.04.1_amd64.deb ...
Unpacking libpython3.6:amd64 (3.6.8-1~18.04.1) ...
Selecting previously unselected package libpython3.6-dev:amd64.
Preparing to unpack .../50-libpython3.6-dev_3.6.8-1~18.04.1_amd64.deb ...
Unpacking libpython3.6-dev:amd64 (3.6.8-1~18.04.1) ...
Selecting previously unselected package libpython3-dev:amd64.
Preparing to unpack .../51-libpython3-dev_3.6.7-1~18.04_amd64.deb ...
Unpacking libpython3-dev:amd64 (3.6.7-1~18.04) ...
Selecting previously unselected package python-pip-whl.
Preparing to unpack .../52-python-pip-whl_9.0.1-2.3~ubuntu1.18.04.1_all.deb ...
Unpacking python-pip-whl (9.0.1-2.3~ubuntu1.18.04.1) ...
Selecting previously unselected package python3-asn1crypto.
Preparing to unpack .../53-python3-asn1crypto_0.24.0-1_all.deb ...
Unpacking python3-asn1crypto (0.24.0-1) ...
Selecting previously unselected package python3-cffi-backend.
Preparing to unpack .../54-python3-cffi-backend_1.11.5-1_amd64.deb ...
Unpacking python3-cffi-backend (1.11.5-1) ...
Selecting previously unselected package python3-crypto.
Preparing to unpack .../55-python3-crypto_2.6.1-8ubuntu2_amd64.deb ...
Unpacking python3-crypto (2.6.1-8ubuntu2) ...
Selecting previously unselected package python3-idna.
Preparing to unpack .../56-python3-idna_2.6-1_all.deb ...
Unpacking python3-idna (2.6-1) ...
Selecting previously unselected package python3-six.
Preparing to unpack .../57-python3-six_1.11.0-2_all.deb ...
Unpacking python3-six (1.11.0-2) ...
Selecting previously unselected package python3-cryptography.
Preparing to unpack .../58-python3-cryptography_2.1.4-1ubuntu1.3_amd64.deb ...
Unpacking python3-cryptography (2.1.4-1ubuntu1.3) ...
Selecting previously unselected package python3.6-dev.
Preparing to unpack .../59-python3.6-dev_3.6.8-1~18.04.1_amd64.deb ...
Unpacking python3.6-dev (3.6.8-1~18.04.1) ...
Selecting previously unselected package python3-dev.
Preparing to unpack .../60-python3-dev_3.6.7-1~18.04_amd64.deb ...
Unpacking python3-dev (3.6.7-1~18.04) ...
Selecting previously unselected package python3-secretstorage.
Preparing to unpack .../61-python3-secretstorage_2.3.1-2_all.deb ...
Unpacking python3-secretstorage (2.3.1-2) ...
Selecting previously unselected package python3-keyring.
Preparing to unpack .../62-python3-keyring_10.6.0-1_all.deb ...
Unpacking python3-keyring (10.6.0-1) ...
Selecting previously unselected package python3-keyrings.alt.
Preparing to unpack .../63-python3-keyrings.alt_3.0-1_all.deb ...
Unpacking python3-keyrings.alt (3.0-1) ...
Selecting previously unselected package python3-pip.
Preparing to unpack .../64-python3-pip_9.0.1-2.3~ubuntu1.18.04.1_all.deb ...
Unpacking python3-pip (9.0.1-2.3~ubuntu1.18.04.1) ...
Selecting previously unselected package python3-pkg-resources.
Preparing to unpack .../65-python3-pkg-resources_39.0.1-2_all.deb ...
Unpacking python3-pkg-resources (39.0.1-2) ...
Selecting previously unselected package python3-setuptools.
Preparing to unpack .../66-python3-setuptools_39.0.1-2_all.deb ...
Unpacking python3-setuptools (39.0.1-2) ...
Selecting previously unselected package python3-wheel.
Preparing to unpack .../67-python3-wheel_0.30.0-0.2_all.deb ...
Unpacking python3-wheel (0.30.0-0.2) ...
Selecting previously unselected package python3-xdg.
Preparing to unpack .../68-python3-xdg_0.25-4ubuntu1_all.deb ...
Unpacking python3-xdg (0.25-4ubuntu1) ...
Setting up libnpth0:amd64 (1.5-3) ...
Setting up python-pip-whl (9.0.1-2.3~ubuntu1.18.04.1) ...
Setting up python3-cffi-backend (1.11.5-1) ...
Setting up python3-crypto (2.6.1-8ubuntu2) ...
Setting up libglib2.0-0:amd64 (2.56.4-0ubuntu0.18.04.3) ...
No schema files found: doing nothing.
Setting up python3-idna (2.6-1) ...
Setting up python3-xdg (0.25-4ubuntu1) ...
Setting up python3-six (1.11.0-2) ...
Setting up libksba8:amd64 (1.3.5-2) ...
Setting up python3-wheel (0.30.0-0.2) ...
Setting up perl-modules-5.26 (5.26.1-6ubuntu0.3) ...
Setting up python3-pkg-resources (39.0.1-2) ...
Setting up libgdbm5:amd64 (1.14.1-6) ...
Setting up libgirepository-1.0-1:amd64 (1.56.1-1) ...
Setting up gnupg-l10n (2.2.4-1ubuntu1.2) ...
Setting up libstdc++-7-dev:amd64 (7.4.0-1ubuntu1~18.04.1) ...
Setting up python3-asn1crypto (0.24.0-1) ...
Setting up gir1.2-glib-2.0:amd64 (1.56.1-1) ...
Setting up patch (2.7.6-2ubuntu1) ...
Setting up libglib2.0-data (2.56.4-0ubuntu0.18.04.3) ...
Processing triggers for libc-bin (2.27-3ubuntu1) ...
Setting up libapparmor1:amd64 (2.12-4ubuntu5.1) ...
Setting up libfakeroot:amd64 (1.22-2ubuntu1) ...
Setting up liblocale-gettext-perl (1.07-3build2) ...
Setting up libexpat1-dev:amd64 (2.2.5-3) ...
Setting up shared-mime-info (1.9-2) ...
Setting up libgdbm-compat4:amd64 (1.14.1-6) ...
Setting up python3-lib2to3 (3.6.8-1~18.04) ...
Setting up libassuan0:amd64 (2.5.1-2) ...
Setting up xdg-user-dirs (0.17-1ubuntu1) ...
Setting up python3-distutils (3.6.8-1~18.04) ...
Setting up libdbus-1-3:amd64 (1.12.2-1ubuntu1.1) ...
Setting up libpython3.6:amd64 (3.6.8-1~18.04.1) ...
Setting up netbase (5.4) ...
Setting up python3-cryptography (2.1.4-1ubuntu1.3) ...
Setting up python3-dbus (1.2.6-1) ...
Setting up g++-7 (7.4.0-1ubuntu1~18.04.1) ...
Setting up gpgconf (2.2.4-1ubuntu1.2) ...
Setting up python3-keyrings.alt (3.0-1) ...
Setting up python3-gi (3.26.1-2ubuntu1) ...
Setting up fakeroot (1.22-2ubuntu1) ...
update-alternatives: using /usr/bin/fakeroot-sysv to provide /usr/bin/fakeroot (fakeroot) in auto mode
update-alternatives: warning: skip creation of /usr/share/man/man1/fakeroot.1.gz because associated file /usr/share/man/man1/fakeroot-sysv.1.gz (of link group fakeroot) doesn't exist
update-alternatives: warning: skip creation of /usr/share/man/man1/faked.1.gz because associated file /usr/share/man/man1/faked-sysv.1.gz (of link group fakeroot) doesn't exist
update-alternatives: warning: skip creation of /usr/share/man/es/man1/fakeroot.1.gz because associated file /usr/share/man/es/man1/fakeroot-sysv.1.gz (of link group fakeroot) doesn't exist
update-alternatives: warning: skip creation of /usr/share/man/es/man1/faked.1.gz because associated file /usr/share/man/es/man1/faked-sysv.1.gz (of link group fakeroot) doesn't exist
update-alternatives: warning: skip creation of /usr/share/man/fr/man1/fakeroot.1.gz because associated file /usr/share/man/fr/man1/fakeroot-sysv.1.gz (of link group fakeroot) doesn't exist
update-alternatives: warning: skip creation of /usr/share/man/fr/man1/faked.1.gz because associated file /usr/share/man/fr/man1/faked-sysv.1.gz (of link group fakeroot) doesn't exist
update-alternatives: warning: skip creation of /usr/share/man/sv/man1/fakeroot.1.gz because associated file /usr/share/man/sv/man1/fakeroot-sysv.1.gz (of link group fakeroot) doesn't exist
update-alternatives: warning: skip creation of /usr/share/man/sv/man1/faked.1.gz because associated file /usr/share/man/sv/man1/faked-sysv.1.gz (of link group fakeroot) doesn't exist
Setting up libpython3.6-dev:amd64 (3.6.8-1~18.04.1) ...
Setting up libperl5.26:amd64 (5.26.1-6ubuntu0.3) ...
Setting up gpgsm (2.2.4-1ubuntu1.2) ...
Setting up python3-pip (9.0.1-2.3~ubuntu1.18.04.1) ...
Setting up gnupg-utils (2.2.4-1ubuntu1.2) ...
Setting up g++ (4:7.4.0-1ubuntu2.3) ...
update-alternatives: using /usr/bin/g++ to provide /usr/bin/c++ (c++) in auto mode
update-alternatives: warning: skip creation of /usr/share/man/man1/c++.1.gz because associated file /usr/share/man/man1/g++.1.gz (of link group c++) doesn't exist
Setting up pinentry-curses (1.1.0-1) ...
Setting up dbus (1.12.2-1ubuntu1.1) ...
Setting up python3-setuptools (39.0.1-2) ...
Setting up python3.6-dev (3.6.8-1~18.04.1) ...
Setting up python3-secretstorage (2.3.1-2) ...
Setting up dirmngr (2.2.4-1ubuntu1.2) ...
Setting up dh-python (3.20180325ubuntu2) ...
Setting up gpg (2.2.4-1ubuntu1.2) ...
Setting up libpython3-dev:amd64 (3.6.7-1~18.04) ...
Setting up python3-keyring (10.6.0-1) ...
Setting up gpg-agent (2.2.4-1ubuntu1.2) ...
Setting up python3-dev (3.6.7-1~18.04) ...
Setting up gpg-wks-server (2.2.4-1ubuntu1.2) ...
Setting up gpg-wks-client (2.2.4-1ubuntu1.2) ...
Setting up perl (5.26.1-6ubuntu0.3) ...
Setting up libfile-fcntllock-perl (0.22-3build2) ...
Setting up libalgorithm-diff-perl (1.19.03-1) ...
Setting up gnupg (2.2.4-1ubuntu1.2) ...
Setting up libdpkg-perl (1.19.0.5ubuntu2.1) ...
Setting up libalgorithm-merge-perl (0.08-3) ...
Setting up dpkg-dev (1.19.0.5ubuntu2.1) ...
Setting up libalgorithm-diff-xs-perl (0.04-5) ...
Setting up build-essential (12.4ubuntu1) ...
Processing triggers for libc-bin (2.27-3ubuntu1) ...

root@02b32b9272ce:/# pip install numpy openjij
bash: pip: command not found

root@02b32b9272ce:/# pip3 install numpy openjij
Collecting numpy
  Downloading https://files.pythonhosted.org/packages/87/2d/e4656149cbadd3a8a0369fcd1a9c7d61cc7b87b3903b85389c70c989a696/numpy-1.16.4-cp36-cp36m-manylinux1_x86_64.whl (17.3MB)
    100% |################################| 17.3MB 90kB/s 
Collecting openjij
  Downloading https://files.pythonhosted.org/packages/32/fc/f7e98f470e1098a7cd9379145978a0aa44c2d6e4efd7e8d6f096f2398192/openjij-0.0.7.tar.gz (80kB)
    100% |################################| 81kB 4.4MB/s 
Collecting requests (from openjij)
  Downloading https://files.pythonhosted.org/packages/51/bd/23c926cd341ea6b7dd0b2a00aba99ae0f828be89d72b2190f27c11d4b7fb/requests-2.22.0-py2.py3-none-any.whl (57kB)
    100% |################################| 61kB 4.7MB/s 
Collecting urllib3!=1.25.0,!=1.25.1,<1.26,>=1.21.1 (from requests->openjij)
  Downloading https://files.pythonhosted.org/packages/e6/60/247f23a7121ae632d62811ba7f273d0e58972d75e58a94d329d51550a47d/urllib3-1.25.3-py2.py3-none-any.whl (150kB)
    100% |################################| 153kB 8.2MB/s 
Collecting chardet<3.1.0,>=3.0.2 (from requests->openjij)
  Downloading https://files.pythonhosted.org/packages/bc/a9/01ffebfb562e4274b6487b4bb1ddec7ca55ec7510b22e4c51f14098443b8/chardet-3.0.4-py2.py3-none-any.whl (133kB)
    100% |################################| 143kB 3.9MB/s 
Collecting certifi>=2017.4.17 (from requests->openjij)
  Downloading https://files.pythonhosted.org/packages/69/1b/b853c7a9d4f6a6d00749e94eb6f3a041e342a885b87340b79c1ef73e3a78/certifi-2019.6.16-py2.py3-none-any.whl (157kB)
    100% |################################| 163kB 8.2MB/s 
Requirement already satisfied: idna<2.9,>=2.5 in /usr/lib/python3/dist-packages (from requests->openjij)
Building wheels for collected packages: openjij
  Running setup.py bdist_wheel for openjij ... error
  Complete output from command /usr/bin/python3 -u -c "import setuptools, tokenize;__file__='/tmp/pip-build-yn5j75hx/openjij/setup.py';f=getattr(tokenize, 'open', open)(__file__);code=f.read().replace('\r\n', '\n');f.close();exec(compile(code, __file__, 'exec'))" bdist_wheel -d /tmp/tmpgiwgl9yypip-wheel- --python-tag cp36:
  /usr/lib/python3.6/distutils/dist.py:261: UserWarning: Unknown distribution option: 'long_description_content_type'
    warnings.warn(msg)
  running bdist_wheel
  running build
  running build_py
  creating build
  creating build/lib.linux-x86_64-3.6
  creating build/lib.linux-x86_64-3.6/openjij
  copying openjij/__init__.py -> build/lib.linux-x86_64-3.6/openjij
  copying openjij/__version.py -> build/lib.linux-x86_64-3.6/openjij
  copying openjij/utils.py -> build/lib.linux-x86_64-3.6/openjij
  creating build/lib.linux-x86_64-3.6/openjij/model
  copying openjij/model/model.py -> build/lib.linux-x86_64-3.6/openjij/model
  copying openjij/model/__init__.py -> build/lib.linux-x86_64-3.6/openjij/model
  copying openjij/model/chimera_model.py -> build/lib.linux-x86_64-3.6/openjij/model
  copying openjij/model/king_graph.py -> build/lib.linux-x86_64-3.6/openjij/model
  creating build/lib.linux-x86_64-3.6/openjij/sampler
  copying openjij/sampler/gpu_sampler.py -> build/lib.linux-x86_64-3.6/openjij/sampler
  copying openjij/sampler/__init__.py -> build/lib.linux-x86_64-3.6/openjij/sampler
  copying openjij/sampler/sampler.py -> build/lib.linux-x86_64-3.6/openjij/sampler
  copying openjij/sampler/response.py -> build/lib.linux-x86_64-3.6/openjij/sampler
  copying openjij/sampler/cmos_annealer.py -> build/lib.linux-x86_64-3.6/openjij/sampler
  running build_ext
  <__main__.CMakeExtension('cxxjij') at 0x7f94c27fd400> cxxjij
  CMake Error at CMakeLists.txt:1 (cmake_minimum_required):
    CMake 3.11 or higher is required.  You are running version 3.10.2


  -- Configuring incomplete, errors occurred!
  Traceback (most recent call last):
    File "<string>", line 1, in <module>
    File "/tmp/pip-build-yn5j75hx/openjij/setup.py", line 126, in <module>
      zip_safe=False
    File "/usr/lib/python3/dist-packages/setuptools/__init__.py", line 129, in setup
      return distutils.core.setup(**attrs)
    File "/usr/lib/python3.6/distutils/core.py", line 148, in setup
      dist.run_commands()
    File "/usr/lib/python3.6/distutils/dist.py", line 955, in run_commands
      self.run_command(cmd)
    File "/usr/lib/python3.6/distutils/dist.py", line 974, in run_command
      cmd_obj.run()
    File "/usr/lib/python3/dist-packages/wheel/bdist_wheel.py", line 204, in run
      self.run_command('build')
    File "/usr/lib/python3.6/distutils/cmd.py", line 313, in run_command
      self.distribution.run_command(command)
    File "/usr/lib/python3.6/distutils/dist.py", line 974, in run_command
      cmd_obj.run()
    File "/usr/lib/python3.6/distutils/command/build.py", line 135, in run
      self.run_command(cmd_name)
    File "/usr/lib/python3.6/distutils/cmd.py", line 313, in run_command
      self.distribution.run_command(command)
    File "/usr/lib/python3.6/distutils/dist.py", line 974, in run_command
      cmd_obj.run()
    File "/tmp/pip-build-yn5j75hx/openjij/setup.py", line 42, in run
      self.build_extension(ext)
    File "/tmp/pip-build-yn5j75hx/openjij/setup.py", line 69, in build_extension
      subprocess.check_call(['cmake', ext.sourcedir] + cmake_kwargs, cwd=self.build_temp, env=env)
    File "/usr/lib/python3.6/subprocess.py", line 311, in check_call
      raise CalledProcessError(retcode, cmd)
  subprocess.CalledProcessError: Command '['cmake', '/tmp/pip-build-yn5j75hx/openjij', '-DCMAKE_LIBRARY_OUTPUT_DIRECTORY=/tmp/pip-build-yn5j75hx/openjij/build/lib.linux-x86_64-3.6', '-DPYTHON_EXECUTABLE=/usr/bin/python3', '-DCMAKE_BUILD_TYPE=Release']' returned non-zero exit status 1.

  ----------------------------------------
  Failed building wheel for openjij
  Running setup.py clean for openjij
Failed to build openjij
Installing collected packages: numpy, urllib3, chardet, certifi, requests, openjij
  Running setup.py install for openjij ... error
    Complete output from command /usr/bin/python3 -u -c "import setuptools, tokenize;__file__='/tmp/pip-build-yn5j75hx/openjij/setup.py';f=getattr(tokenize, 'open', open)(__file__);code=f.read().replace('\r\n', '\n');f.close();exec(compile(code, __file__, 'exec'))" install --record /tmp/pip-jop77n9c-record/install-record.txt --single-version-externally-managed --compile:
    /usr/lib/python3.6/distutils/dist.py:261: UserWarning: Unknown distribution option: 'long_description_content_type'
      warnings.warn(msg)
    running install
    running build
    running build_py
    creating build
    creating build/lib.linux-x86_64-3.6
    creating build/lib.linux-x86_64-3.6/openjij
    copying openjij/__init__.py -> build/lib.linux-x86_64-3.6/openjij
    copying openjij/__version.py -> build/lib.linux-x86_64-3.6/openjij
    copying openjij/utils.py -> build/lib.linux-x86_64-3.6/openjij
    creating build/lib.linux-x86_64-3.6/openjij/model
    copying openjij/model/model.py -> build/lib.linux-x86_64-3.6/openjij/model
    copying openjij/model/__init__.py -> build/lib.linux-x86_64-3.6/openjij/model
    copying openjij/model/chimera_model.py -> build/lib.linux-x86_64-3.6/openjij/model
    copying openjij/model/king_graph.py -> build/lib.linux-x86_64-3.6/openjij/model
    creating build/lib.linux-x86_64-3.6/openjij/sampler
    copying openjij/sampler/gpu_sampler.py -> build/lib.linux-x86_64-3.6/openjij/sampler
    copying openjij/sampler/__init__.py -> build/lib.linux-x86_64-3.6/openjij/sampler
    copying openjij/sampler/sampler.py -> build/lib.linux-x86_64-3.6/openjij/sampler
    copying openjij/sampler/response.py -> build/lib.linux-x86_64-3.6/openjij/sampler
    copying openjij/sampler/cmos_annealer.py -> build/lib.linux-x86_64-3.6/openjij/sampler
    running build_ext
    <__main__.CMakeExtension('cxxjij') at 0x7f69320b9898> cxxjij
    CMake Error at CMakeLists.txt:1 (cmake_minimum_required):
      CMake 3.11 or higher is required.  You are running version 3.10.2


    -- Configuring incomplete, errors occurred!
    Traceback (most recent call last):
      File "<string>", line 1, in <module>
      File "/tmp/pip-build-yn5j75hx/openjij/setup.py", line 126, in <module>
        zip_safe=False
      File "/usr/lib/python3/dist-packages/setuptools/__init__.py", line 129, in setup
        return distutils.core.setup(**attrs)
      File "/usr/lib/python3.6/distutils/core.py", line 148, in setup
        dist.run_commands()
      File "/usr/lib/python3.6/distutils/dist.py", line 955, in run_commands
        self.run_command(cmd)
      File "/usr/lib/python3.6/distutils/dist.py", line 974, in run_command
        cmd_obj.run()
      File "/usr/lib/python3/dist-packages/setuptools/command/install.py", line 61, in run
        return orig.install.run(self)
      File "/usr/lib/python3.6/distutils/command/install.py", line 589, in run
        self.run_command('build')
      File "/usr/lib/python3.6/distutils/cmd.py", line 313, in run_command
        self.distribution.run_command(command)
      File "/usr/lib/python3.6/distutils/dist.py", line 974, in run_command
        cmd_obj.run()
      File "/usr/lib/python3.6/distutils/command/build.py", line 135, in run
        self.run_command(cmd_name)
      File "/usr/lib/python3.6/distutils/cmd.py", line 313, in run_command
        self.distribution.run_command(command)
      File "/usr/lib/python3.6/distutils/dist.py", line 974, in run_command
        cmd_obj.run()
      File "/tmp/pip-build-yn5j75hx/openjij/setup.py", line 42, in run
        self.build_extension(ext)
      File "/tmp/pip-build-yn5j75hx/openjij/setup.py", line 69, in build_extension
        subprocess.check_call(['cmake', ext.sourcedir] + cmake_kwargs, cwd=self.build_temp, env=env)
      File "/usr/lib/python3.6/subprocess.py", line 311, in check_call
        raise CalledProcessError(retcode, cmd)
    subprocess.CalledProcessError: Command '['cmake', '/tmp/pip-build-yn5j75hx/openjij', '-DCMAKE_LIBRARY_OUTPUT_DIRECTORY=/tmp/pip-build-yn5j75hx/openjij/build/lib.linux-x86_64-3.6', '-DPYTHON_EXECUTABLE=/usr/bin/python3', '-DCMAKE_BUILD_TYPE=Release']' returned non-zero exit status 1.

    ----------------------------------------
Command "/usr/bin/python3 -u -c "import setuptools, tokenize;__file__='/tmp/pip-build-yn5j75hx/openjij/setup.py';f=getattr(tokenize, 'open', open)(__file__);code=f.read().replace('\r\n', '\n');f.close();exec(compile(code, __file__, 'exec'))" install --record /tmp/pip-jop77n9c-record/install-record.txt --single-version-externally-managed --compile" failed with error code 1 in /tmp/pip-build-yn5j75hx/openjij/

CMake 3.11 or higher is required. You are running version 3.10.2

cmake 3.14を入れてみた。

# pip3 install openjij
Collecting openjij
  Using cached https://files.pythonhosted.org/packages/32/fc/f7e98f470e1098a7cd9379145978a0aa44c2d6e4efd7e8d6f096f2398192/openjij-0.0.7.tar.gz
Requirement already satisfied: numpy in /usr/local/lib/python3.6/dist-packages (from openjij)
Requirement already satisfied: requests in /usr/local/lib/python3.6/dist-packages (from openjij)
Requirement already satisfied: idna<2.9,>=2.5 in /usr/lib/python3/dist-packages (from requests->openjij)
Requirement already satisfied: urllib3!=1.25.0,!=1.25.1,<1.26,>=1.21.1 in /usr/local/lib/python3.6/dist-packages (from requests->openjij)
Requirement already satisfied: certifi>=2017.4.17 in /usr/local/lib/python3.6/dist-packages (from requests->openjij)
Requirement already satisfied: chardet<3.1.0,>=3.0.2 in /usr/local/lib/python3.6/dist-packages (from requests->openjij)
Building wheels for collected packages: openjij
  Running setup.py bdist_wheel for openjij ... error
  Complete output from command /usr/bin/python3 -u -c "import setuptools, tokenize;__file__='/tmp/pip-build-48h2_juh/openjij/setup.py';f=getattr(tokenize, 'open', open)(__file__);code=f.read().replace('\r\n', '\n');f.close();exec(compile(code, __file__, 'exec'))" bdist_wheel -d /tmp/tmpajpqijjspip-wheel- --python-tag cp36:
  /usr/lib/python3.6/distutils/dist.py:261: UserWarning: Unknown distribution option: 'long_description_content_type'
    warnings.warn(msg)
  running bdist_wheel
  running build
  running build_py
  creating build
  creating build/lib.linux-x86_64-3.6
  creating build/lib.linux-x86_64-3.6/openjij
  copying openjij/__init__.py -> build/lib.linux-x86_64-3.6/openjij
  copying openjij/__version.py -> build/lib.linux-x86_64-3.6/openjij
  copying openjij/utils.py -> build/lib.linux-x86_64-3.6/openjij
  creating build/lib.linux-x86_64-3.6/openjij/model
  copying openjij/model/model.py -> build/lib.linux-x86_64-3.6/openjij/model
  copying openjij/model/__init__.py -> build/lib.linux-x86_64-3.6/openjij/model
  copying openjij/model/chimera_model.py -> build/lib.linux-x86_64-3.6/openjij/model
  copying openjij/model/king_graph.py -> build/lib.linux-x86_64-3.6/openjij/model
  creating build/lib.linux-x86_64-3.6/openjij/sampler
  copying openjij/sampler/gpu_sampler.py -> build/lib.linux-x86_64-3.6/openjij/sampler
  copying openjij/sampler/__init__.py -> build/lib.linux-x86_64-3.6/openjij/sampler
  copying openjij/sampler/sampler.py -> build/lib.linux-x86_64-3.6/openjij/sampler
  copying openjij/sampler/response.py -> build/lib.linux-x86_64-3.6/openjij/sampler
  copying openjij/sampler/cmos_annealer.py -> build/lib.linux-x86_64-3.6/openjij/sampler
  running build_ext
  <__main__.CMakeExtension('cxxjij') at 0x7f514ecb28d0> cxxjij
  -- The C compiler identification is GNU 7.4.0
  -- The CXX compiler identification is GNU 7.4.0
  -- Check for working C compiler: /usr/bin/cc
  -- Check for working C compiler: /usr/bin/cc -- works
  -- Detecting C compiler ABI info
  -- Detecting C compiler ABI info - done
  -- Detecting C compile features
  -- Detecting C compile features - done
  -- Check for working CXX compiler: /usr/bin/c++
  -- Check for working CXX compiler: /usr/bin/c++ -- works
  -- Detecting CXX compiler ABI info
  -- Detecting CXX compiler ABI info - done
  -- Detecting CXX compile features
  -- Detecting CXX compile features - done
  -- Fetch googletest for C++ testing
  CMake Error at /opt/cmake-3.14.5-Linux-x86_64/share/cmake-3.14/Modules/ExternalProject.cmake:2427 (message):
    error: could not find git for clone of googletest-populate
  Call Stack (most recent call first):
    /opt/cmake-3.14.5-Linux-x86_64/share/cmake-3.14/Modules/ExternalProject.cmake:3211 (_ep_add_download_command)
    CMakeLists.txt:13 (ExternalProject_Add)


  -- Configuring incomplete, errors occurred!
  See also "/tmp/pip-build-48h2_juh/openjij/build/temp.linux-x86_64-3.6/_deps/googletest-subbuild/CMakeFiles/CMakeOutput.log".

  CMake Error at /opt/cmake-3.14.5-Linux-x86_64/share/cmake-3.14/Modules/FetchContent.cmake:903 (message):
    CMake step for googletest failed: 1
  Call Stack (most recent call first):
    /opt/cmake-3.14.5-Linux-x86_64/share/cmake-3.14/Modules/FetchContent.cmake:1006 (__FetchContent_directPopulate)
    CMakeLists.txt:21 (FetchContent_Populate)


  -- Configuring incomplete, errors occurred!
  See also "/tmp/pip-build-48h2_juh/openjij/build/temp.linux-x86_64-3.6/CMakeFiles/CMakeOutput.log".
  Traceback (most recent call last):
    File "<string>", line 1, in <module>
    File "/tmp/pip-build-48h2_juh/openjij/setup.py", line 126, in <module>
      zip_safe=False
    File "/usr/lib/python3/dist-packages/setuptools/__init__.py", line 129, in setup
      return distutils.core.setup(**attrs)
    File "/usr/lib/python3.6/distutils/core.py", line 148, in setup
      dist.run_commands()
    File "/usr/lib/python3.6/distutils/dist.py", line 955, in run_commands
      self.run_command(cmd)
    File "/usr/lib/python3.6/distutils/dist.py", line 974, in run_command
      cmd_obj.run()
    File "/usr/lib/python3/dist-packages/wheel/bdist_wheel.py", line 204, in run
      self.run_command('build')
    File "/usr/lib/python3.6/distutils/cmd.py", line 313, in run_command
      self.distribution.run_command(command)
    File "/usr/lib/python3.6/distutils/dist.py", line 974, in run_command
      cmd_obj.run()
    File "/usr/lib/python3.6/distutils/command/build.py", line 135, in run
      self.run_command(cmd_name)
    File "/usr/lib/python3.6/distutils/cmd.py", line 313, in run_command
      self.distribution.run_command(command)
    File "/usr/lib/python3.6/distutils/dist.py", line 974, in run_command
      cmd_obj.run()
    File "/tmp/pip-build-48h2_juh/openjij/setup.py", line 42, in run
      self.build_extension(ext)
    File "/tmp/pip-build-48h2_juh/openjij/setup.py", line 69, in build_extension
      subprocess.check_call(['cmake', ext.sourcedir] + cmake_kwargs, cwd=self.build_temp, env=env)
    File "/usr/lib/python3.6/subprocess.py", line 311, in check_call
      raise CalledProcessError(retcode, cmd)
  subprocess.CalledProcessError: Command '['cmake', '/tmp/pip-build-48h2_juh/openjij', '-DCMAKE_LIBRARY_OUTPUT_DIRECTORY=/tmp/pip-build-48h2_juh/openjij/build/lib.linux-x86_64-3.6', '-DPYTHON_EXECUTABLE=/usr/bin/python3', '-DCMAKE_BUILD_TYPE=Release']' returned non-zero exit status 1.

  ----------------------------------------
  Failed building wheel for openjij
  Running setup.py clean for openjij
Failed to build openjij
Installing collected packages: openjij
  Running setup.py install for openjij ... error
    Complete output from command /usr/bin/python3 -u -c "import setuptools, tokenize;__file__='/tmp/pip-build-48h2_juh/openjij/setup.py';f=getattr(tokenize, 'open', open)(__file__);code=f.read().replace('\r\n', '\n');f.close();exec(compile(code, __file__, 'exec'))" install --record /tmp/pip-vichorhz-record/install-record.txt --single-version-externally-managed --compile:
    /usr/lib/python3.6/distutils/dist.py:261: UserWarning: Unknown distribution option: 'long_description_content_type'
      warnings.warn(msg)
    running install
    running build
    running build_py
    creating build
    creating build/lib.linux-x86_64-3.6
    creating build/lib.linux-x86_64-3.6/openjij
    copying openjij/__init__.py -> build/lib.linux-x86_64-3.6/openjij
    copying openjij/__version.py -> build/lib.linux-x86_64-3.6/openjij
    copying openjij/utils.py -> build/lib.linux-x86_64-3.6/openjij
    creating build/lib.linux-x86_64-3.6/openjij/model
    copying openjij/model/model.py -> build/lib.linux-x86_64-3.6/openjij/model
    copying openjij/model/__init__.py -> build/lib.linux-x86_64-3.6/openjij/model
    copying openjij/model/chimera_model.py -> build/lib.linux-x86_64-3.6/openjij/model
    copying openjij/model/king_graph.py -> build/lib.linux-x86_64-3.6/openjij/model
    creating build/lib.linux-x86_64-3.6/openjij/sampler
    copying openjij/sampler/gpu_sampler.py -> build/lib.linux-x86_64-3.6/openjij/sampler
    copying openjij/sampler/__init__.py -> build/lib.linux-x86_64-3.6/openjij/sampler
    copying openjij/sampler/sampler.py -> build/lib.linux-x86_64-3.6/openjij/sampler
    copying openjij/sampler/response.py -> build/lib.linux-x86_64-3.6/openjij/sampler
    copying openjij/sampler/cmos_annealer.py -> build/lib.linux-x86_64-3.6/openjij/sampler
    running build_ext
    <__main__.CMakeExtension('cxxjij') at 0x7fa61d106898> cxxjij
    -- The C compiler identification is GNU 7.4.0
    -- The CXX compiler identification is GNU 7.4.0
    -- Check for working C compiler: /usr/bin/cc
    -- Check for working C compiler: /usr/bin/cc -- works
    -- Detecting C compiler ABI info
    -- Detecting C compiler ABI info - done
    -- Detecting C compile features
    -- Detecting C compile features - done
    -- Check for working CXX compiler: /usr/bin/c++
    -- Check for working CXX compiler: /usr/bin/c++ -- works
    -- Detecting CXX compiler ABI info
    -- Detecting CXX compiler ABI info - done
    -- Detecting CXX compile features
    -- Detecting CXX compile features - done
    -- Fetch googletest for C++ testing
    CMake Error at /opt/cmake-3.14.5-Linux-x86_64/share/cmake-3.14/Modules/ExternalProject.cmake:2427 (message):
      error: could not find git for clone of googletest-populate
    Call Stack (most recent call first):
      /opt/cmake-3.14.5-Linux-x86_64/share/cmake-3.14/Modules/ExternalProject.cmake:3211 (_ep_add_download_command)
      CMakeLists.txt:13 (ExternalProject_Add)


    -- Configuring incomplete, errors occurred!
    See also "/tmp/pip-build-48h2_juh/openjij/build/temp.linux-x86_64-3.6/_deps/googletest-subbuild/CMakeFiles/CMakeOutput.log".

    CMake Error at /opt/cmake-3.14.5-Linux-x86_64/share/cmake-3.14/Modules/FetchContent.cmake:903 (message):
      CMake step for googletest failed: 1
    Call Stack (most recent call first):
      /opt/cmake-3.14.5-Linux-x86_64/share/cmake-3.14/Modules/FetchContent.cmake:1006 (__FetchContent_directPopulate)
      CMakeLists.txt:21 (FetchContent_Populate)


    -- Configuring incomplete, errors occurred!
    See also "/tmp/pip-build-48h2_juh/openjij/build/temp.linux-x86_64-3.6/CMakeFiles/CMakeOutput.log".
    Traceback (most recent call last):
      File "<string>", line 1, in <module>
      File "/tmp/pip-build-48h2_juh/openjij/setup.py", line 126, in <module>
        zip_safe=False
      File "/usr/lib/python3/dist-packages/setuptools/__init__.py", line 129, in setup
        return distutils.core.setup(**attrs)
      File "/usr/lib/python3.6/distutils/core.py", line 148, in setup
        dist.run_commands()
      File "/usr/lib/python3.6/distutils/dist.py", line 955, in run_commands
        self.run_command(cmd)
      File "/usr/lib/python3.6/distutils/dist.py", line 974, in run_command
        cmd_obj.run()
      File "/usr/lib/python3/dist-packages/setuptools/command/install.py", line 61, in run
        return orig.install.run(self)
      File "/usr/lib/python3.6/distutils/command/install.py", line 589, in run
        self.run_command('build')
      File "/usr/lib/python3.6/distutils/cmd.py", line 313, in run_command
        self.distribution.run_command(command)
      File "/usr/lib/python3.6/distutils/dist.py", line 974, in run_command
        cmd_obj.run()
      File "/usr/lib/python3.6/distutils/command/build.py", line 135, in run
        self.run_command(cmd_name)
      File "/usr/lib/python3.6/distutils/cmd.py", line 313, in run_command
        self.distribution.run_command(command)
      File "/usr/lib/python3.6/distutils/dist.py", line 974, in run_command
        cmd_obj.run()
      File "/tmp/pip-build-48h2_juh/openjij/setup.py", line 42, in run
        self.build_extension(ext)
      File "/tmp/pip-build-48h2_juh/openjij/setup.py", line 69, in build_extension
        subprocess.check_call(['cmake', ext.sourcedir] + cmake_kwargs, cwd=self.build_temp, env=env)
      File "/usr/lib/python3.6/subprocess.py", line 311, in check_call
        raise CalledProcessError(retcode, cmd)
    subprocess.CalledProcessError: Command '['cmake', '/tmp/pip-build-48h2_juh/openjij', '-DCMAKE_LIBRARY_OUTPUT_DIRECTORY=/tmp/pip-build-48h2_juh/openjij/build/lib.linux-x86_64-3.6', '-DPYTHON_EXECUTABLE=/usr/bin/python3', '-DCMAKE_BUILD_TYPE=Release']' returned non-zero exit status 1.

    ----------------------------------------
Command "/usr/bin/python3 -u -c "import setuptools, tokenize;__file__='/tmp/pip-build-48h2_juh/openjij/setup.py';f=getattr(tokenize, 'open', open)(__file__);code=f.read().replace('\r\n', '\n');f.close();exec(compile(code, __file__, 'exec'))" install --record /tmp/pip-vichorhz-record/install-record.txt --single-version-externally-managed --compile" failed with error code 1 in /tmp/pip-build-48h2_juh/openjij/

git がないらしい。

# apt install git
Reading package lists... Done
Building dependency tree       
Reading state information... Done
The following packages were automatically installed and are no longer required:
  cmake-data libarchive13 libcurl4 libjsoncpp1 liblzo2-2 librhash0 libuv1
Use 'apt autoremove' to remove them.
The following additional packages will be installed:
  git-man less libbsd0 libcurl3-gnutls libedit2 liberror-perl libssl1.0.0 libx11-6
  libx11-data libxau6 libxcb1 libxdmcp6 libxext6 libxmuu1 openssh-client xauth
Suggested packages:
  gettext-base git-daemon-run | git-daemon-sysvinit git-doc git-el git-email git-gui gitk
  gitweb git-cvs git-mediawiki git-svn keychain libpam-ssh monkeysphere ssh-askpass
The following NEW packages will be installed:
  git git-man less libbsd0 libcurl3-gnutls libedit2 liberror-perl libssl1.0.0 libx11-6
  libx11-data libxau6 libxcb1 libxdmcp6 libxext6 libxmuu1 openssh-client xauth
0 upgraded, 17 newly installed, 0 to remove and 0 not upgraded.
Need to get 7688 kB of archives.
After this operation, 46.3 MB of additional disk space will be used.
Do you want to continue? [Y/n] y
Get:1 http://archive.ubuntu.com/ubuntu bionic/main amd64 libxau6 amd64 1:1.0.8-1 [8376 B]
Get:2 http://archive.ubuntu.com/ubuntu bionic/main amd64 libbsd0 amd64 0.8.7-1 [41.5 kB]
Get:3 http://archive.ubuntu.com/ubuntu bionic/main amd64 libxdmcp6 amd64 1:1.1.2-3 [10.7 kB]
Get:4 http://archive.ubuntu.com/ubuntu bionic-updates/main amd64 libxcb1 amd64 1.13-2~ubuntu18.04 [45.5 kB]
Get:5 http://archive.ubuntu.com/ubuntu bionic-updates/main amd64 libx11-data all 2:1.6.4-3ubuntu0.2 [113 kB]
Get:6 http://archive.ubuntu.com/ubuntu bionic-updates/main amd64 libx11-6 amd64 2:1.6.4-3ubuntu0.2 [569 kB]
Get:7 http://archive.ubuntu.com/ubuntu bionic/main amd64 libxext6 amd64 2:1.3.3-1 [29.4 kB]
Get:8 http://archive.ubuntu.com/ubuntu bionic/main amd64 less amd64 487-0.1 [112 kB]
Get:9 http://archive.ubuntu.com/ubuntu bionic/main amd64 libedit2 amd64 3.1-20170329-1 [76.9 kB]
Get:10 http://archive.ubuntu.com/ubuntu bionic-updates/main amd64 libssl1.0.0 amd64 1.0.2n-1ubuntu5.3 [1088 kB]
Get:11 http://archive.ubuntu.com/ubuntu bionic/main amd64 libxmuu1 amd64 2:1.1.2-2 [9674 B]
Get:12 http://archive.ubuntu.com/ubuntu bionic-updates/main amd64 openssh-client amd64 1:7.6p1-4ubuntu0.3 [614 kB]
Get:13 http://archive.ubuntu.com/ubuntu bionic/main amd64 xauth amd64 1:1.0.10-1 [24.6 kB]
Get:14 http://archive.ubuntu.com/ubuntu bionic-updates/main amd64 libcurl3-gnutls amd64 7.58.0-2ubuntu3.7 [212 kB]
Get:15 http://archive.ubuntu.com/ubuntu bionic/main amd64 liberror-perl all 0.17025-1 [22.8 kB]
Get:16 http://archive.ubuntu.com/ubuntu bionic-updates/main amd64 git-man all 1:2.17.1-1ubuntu0.4 [803 kB]
Get:17 http://archive.ubuntu.com/ubuntu bionic-updates/main amd64 git amd64 1:2.17.1-1ubuntu0.4 [3907 kB]
Fetched 7688 kB in 4s (2069 kB/s)
debconf: delaying package configuration, since apt-utils is not installed
Selecting previously unselected package libxau6:amd64.
(Reading database ... 17340 files and directories currently installed.)
Preparing to unpack .../00-libxau6_1%3a1.0.8-1_amd64.deb ...
Unpacking libxau6:amd64 (1:1.0.8-1) ...
Selecting previously unselected package libbsd0:amd64.
Preparing to unpack .../01-libbsd0_0.8.7-1_amd64.deb ...
Unpacking libbsd0:amd64 (0.8.7-1) ...
Selecting previously unselected package libxdmcp6:amd64.
Preparing to unpack .../02-libxdmcp6_1%3a1.1.2-3_amd64.deb ...
Unpacking libxdmcp6:amd64 (1:1.1.2-3) ...
Selecting previously unselected package libxcb1:amd64.
Preparing to unpack .../03-libxcb1_1.13-2~ubuntu18.04_amd64.deb ...
Unpacking libxcb1:amd64 (1.13-2~ubuntu18.04) ...
Selecting previously unselected package libx11-data.
Preparing to unpack .../04-libx11-data_2%3a1.6.4-3ubuntu0.2_all.deb ...
Unpacking libx11-data (2:1.6.4-3ubuntu0.2) ...
Selecting previously unselected package libx11-6:amd64.
Preparing to unpack .../05-libx11-6_2%3a1.6.4-3ubuntu0.2_amd64.deb ...
Unpacking libx11-6:amd64 (2:1.6.4-3ubuntu0.2) ...
Selecting previously unselected package libxext6:amd64.
Preparing to unpack .../06-libxext6_2%3a1.3.3-1_amd64.deb ...
Unpacking libxext6:amd64 (2:1.3.3-1) ...
Selecting previously unselected package less.
Preparing to unpack .../07-less_487-0.1_amd64.deb ...
Unpacking less (487-0.1) ...
Selecting previously unselected package libedit2:amd64.
Preparing to unpack .../08-libedit2_3.1-20170329-1_amd64.deb ...
Unpacking libedit2:amd64 (3.1-20170329-1) ...
Selecting previously unselected package libssl1.0.0:amd64.
Preparing to unpack .../09-libssl1.0.0_1.0.2n-1ubuntu5.3_amd64.deb ...
Unpacking libssl1.0.0:amd64 (1.0.2n-1ubuntu5.3) ...
Selecting previously unselected package libxmuu1:amd64.
Preparing to unpack .../10-libxmuu1_2%3a1.1.2-2_amd64.deb ...
Unpacking libxmuu1:amd64 (2:1.1.2-2) ...
Selecting previously unselected package openssh-client.
Preparing to unpack .../11-openssh-client_1%3a7.6p1-4ubuntu0.3_amd64.deb ...
Unpacking openssh-client (1:7.6p1-4ubuntu0.3) ...
Selecting previously unselected package xauth.
Preparing to unpack .../12-xauth_1%3a1.0.10-1_amd64.deb ...
Unpacking xauth (1:1.0.10-1) ...
Selecting previously unselected package libcurl3-gnutls:amd64.
Preparing to unpack .../13-libcurl3-gnutls_7.58.0-2ubuntu3.7_amd64.deb ...
Unpacking libcurl3-gnutls:amd64 (7.58.0-2ubuntu3.7) ...
Selecting previously unselected package liberror-perl.
Preparing to unpack .../14-liberror-perl_0.17025-1_all.deb ...
Unpacking liberror-perl (0.17025-1) ...
Selecting previously unselected package git-man.
Preparing to unpack .../15-git-man_1%3a2.17.1-1ubuntu0.4_all.deb ...
Unpacking git-man (1:2.17.1-1ubuntu0.4) ...
Selecting previously unselected package git.
Preparing to unpack .../16-git_1%3a2.17.1-1ubuntu0.4_amd64.deb ...
Unpacking git (1:2.17.1-1ubuntu0.4) ...
Setting up libedit2:amd64 (3.1-20170329-1) ...
Setting up git-man (1:2.17.1-1ubuntu0.4) ...
Setting up less (487-0.1) ...
debconf: unable to initialize frontend: Dialog
debconf: (No usable dialog-like program is installed, so the dialog based frontend cannot be used. at /usr/share/perl5/Debconf/FrontEnd/Dialog.pm line 76.)
debconf: falling back to frontend: Readline
Setting up libssl1.0.0:amd64 (1.0.2n-1ubuntu5.3) ...
debconf: unable to initialize frontend: Dialog
debconf: (No usable dialog-like program is installed, so the dialog based frontend cannot be used. at /usr/share/perl5/Debconf/FrontEnd/Dialog.pm line 76.)
debconf: falling back to frontend: Readline
Processing triggers for mime-support (3.60ubuntu1) ...
Setting up liberror-perl (0.17025-1) ...
Setting up libcurl3-gnutls:amd64 (7.58.0-2ubuntu3.7) ...
Setting up libbsd0:amd64 (0.8.7-1) ...
Processing triggers for libc-bin (2.27-3ubuntu1) ...
Setting up libxdmcp6:amd64 (1:1.1.2-3) ...
Setting up openssh-client (1:7.6p1-4ubuntu0.3) ...
Setting up git (1:2.17.1-1ubuntu0.4) ...
Setting up libx11-data (2:1.6.4-3ubuntu0.2) ...
Setting up libxau6:amd64 (1:1.0.8-1) ...
Setting up libxcb1:amd64 (1.13-2~ubuntu18.04) ...
Setting up libx11-6:amd64 (2:1.6.4-3ubuntu0.2) ...
Setting up libxmuu1:amd64 (2:1.1.2-2) ...
Setting up libxext6:amd64 (2:1.3.3-1) ...
Setting up xauth (1:1.0.10-1) ...
Processing triggers for libc-bin (2.27-3ubuntu1) ...

そして

root@02b32b9272ce:/# pip3 install openjij
Collecting openjij
  Using cached https://files.pythonhosted.org/packages/32/fc/f7e98f470e1098a7cd9379145978a0aa44c2d6e4efd7e8d6f096f2398192/openjij-0.0.7.tar.gz
Requirement already satisfied: numpy in /usr/local/lib/python3.6/dist-packages (from openjij)
Requirement already satisfied: requests in /usr/local/lib/python3.6/dist-packages (from openjij)
Requirement already satisfied: idna<2.9,>=2.5 in /usr/lib/python3/dist-packages (from requests->openjij)
Requirement already satisfied: urllib3!=1.25.0,!=1.25.1,<1.26,>=1.21.1 in /usr/local/lib/python3.6/dist-packages (from requests->openjij)
Requirement already satisfied: chardet<3.1.0,>=3.0.2 in /usr/local/lib/python3.6/dist-packages (from requests->openjij)
Requirement already satisfied: certifi>=2017.4.17 in /usr/local/lib/python3.6/dist-packages (from requests->openjij)
Building wheels for collected packages: openjij
  Running setup.py bdist_wheel for openjij ... done
  Stored in directory: /root/.cache/pip/wheels/bf/8d/f6/04623fb4b2e90c961fc7b531fb6ab26825b3bef6ae1ef350e6
Successfully built openjij
Installing collected packages: openjij
Successfully installed openjij-0.0.7

ということは、

git
CMake 3.11 or higher is required.
python3
pip
numpy

が必要だということ。

dockerでは
apt update, apt -y upgrade
apt -y vim wget
していること。

では、1からやってみる。

その前に動くかためしてみた。
OpenJij チュートリアル
https://openjij.github.io/OpenJijTutorial/_build/html/ja/index.html

ising.py
import openjij as oj
#https://openjij.github.io/OpenJijTutorial/_build/html/ja/index.html

# 問題を表す縦磁場と相互作用を作ります。OpenJijでは辞書型で問題を受け付けます。
N = 5
h = {i: -1 for i in range(N)}
J = {(i, j): -1 for i in range(N) for j in range(i+1, N)}

print('h_i: ', h)
print('Jij: ', J)

実行してみる。

# pip3 show openjij
Name: openjij
Version: 0.0.7
Summary: Framework for the Ising model and QUBO
Home-page: https://openjij.github.io/OpenJij/
Author: Jij Inc.
Author-email: openjij@j-ij.com
License: Apache License 2.0
Location: /usr/local/lib/python3.6/dist-packages
Requires: numpy, requests
root@02b32b9272ce:/# pip install requests
bash: pip: command not found
root@02b32b9272ce:/# pip3 install requests
Requirement already satisfied: requests in /usr/local/lib/python3.6/dist-packages
Requirement already satisfied: idna<2.9,>=2.5 in /usr/lib/python3/dist-packages (from requests)
Requirement already satisfied: chardet<3.1.0,>=3.0.2 in /usr/local/lib/python3.6/dist-packages (from requests)
Requirement already satisfied: urllib3!=1.25.0,!=1.25.1,<1.26,>=1.21.1 in /usr/local/lib/python3.6/dist-packages (from requests)
Requirement already satisfied: certifi>=2017.4.17 in /usr/local/lib/python3.6/dist-packages (from requests)
root@02b32b9272ce:/# apt install vim
Reading package lists... Done
Building dependency tree       
Reading state information... Done
The following packages were automatically installed and are no longer required:
  cmake-data libarchive13 libcurl4 libjsoncpp1 liblzo2-2 librhash0 libuv1
Use 'apt autoremove' to remove them.
The following additional packages will be installed:
  libgpm2 vim-common vim-runtime xxd
Suggested packages:
  gpm ctags vim-doc vim-scripts
The following NEW packages will be installed:
  libgpm2 vim vim-common vim-runtime xxd
0 upgraded, 5 newly installed, 0 to remove and 0 not upgraded.
Need to get 6721 kB of archives.
After this operation, 32.6 MB of additional disk space will be used.
Do you want to continue? [Y/n] y
Get:1 http://archive.ubuntu.com/ubuntu bionic-updates/main amd64 xxd amd64 2:8.0.1453-1ubuntu1.1 [49.2 kB]
Get:2 http://archive.ubuntu.com/ubuntu bionic-updates/main amd64 vim-common all 2:8.0.1453-1ubuntu1.1 [70.4 kB]
Get:3 http://archive.ubuntu.com/ubuntu bionic/main amd64 libgpm2 amd64 1.20.7-5 [15.1 kB]
Get:4 http://archive.ubuntu.com/ubuntu bionic-updates/main amd64 vim-runtime all 2:8.0.1453-1ubuntu1.1 [5435 kB]
Get:5 http://archive.ubuntu.com/ubuntu bionic-updates/main amd64 vim amd64 2:8.0.1453-1ubuntu1.1 [1152 kB]
Fetched 6721 kB in 5s (1474 kB/s)
debconf: delaying package configuration, since apt-utils is not installed
Selecting previously unselected package xxd.
(Reading database ... 18648 files and directories currently installed.)
Preparing to unpack .../xxd_2%3a8.0.1453-1ubuntu1.1_amd64.deb ...
Unpacking xxd (2:8.0.1453-1ubuntu1.1) ...
Selecting previously unselected package vim-common.
Preparing to unpack .../vim-common_2%3a8.0.1453-1ubuntu1.1_all.deb ...
Unpacking vim-common (2:8.0.1453-1ubuntu1.1) ...
Selecting previously unselected package libgpm2:amd64.
Preparing to unpack .../libgpm2_1.20.7-5_amd64.deb ...
Unpacking libgpm2:amd64 (1.20.7-5) ...
Selecting previously unselected package vim-runtime.
Preparing to unpack .../vim-runtime_2%3a8.0.1453-1ubuntu1.1_all.deb ...
Adding 'diversion of /usr/share/vim/vim80/doc/help.txt to /usr/share/vim/vim80/doc/help.txt.vim-tiny by vim-runtime'
Adding 'diversion of /usr/share/vim/vim80/doc/tags to /usr/share/vim/vim80/doc/tags.vim-tiny by vim-runtime'
Unpacking vim-runtime (2:8.0.1453-1ubuntu1.1) ...
Selecting previously unselected package vim.
Preparing to unpack .../vim_2%3a8.0.1453-1ubuntu1.1_amd64.deb ...
Unpacking vim (2:8.0.1453-1ubuntu1.1) ...
Processing triggers for mime-support (3.60ubuntu1) ...
Setting up xxd (2:8.0.1453-1ubuntu1.1) ...
Setting up libgpm2:amd64 (1.20.7-5) ...
Processing triggers for libc-bin (2.27-3ubuntu1) ...
Setting up vim-common (2:8.0.1453-1ubuntu1.1) ...
Setting up vim-runtime (2:8.0.1453-1ubuntu1.1) ...
Setting up vim (2:8.0.1453-1ubuntu1.1) ...
update-alternatives: using /usr/bin/vim.basic to provide /usr/bin/vim (vim) in auto mode
update-alternatives: using /usr/bin/vim.basic to provide /usr/bin/vimdiff (vimdiff) in auto mode
update-alternatives: using /usr/bin/vim.basic to provide /usr/bin/rvim (rvim) in auto mode
update-alternatives: using /usr/bin/vim.basic to provide /usr/bin/rview (rview) in auto mode
update-alternatives: using /usr/bin/vim.basic to provide /usr/bin/vi (vi) in auto mode
update-alternatives: warning: skip creation of /usr/share/man/fr/man1/vi.1.gz because associated file /usr/share/man/fr/man1/vim.1.gz (of link group vi) doesn't exist
update-alternatives: warning: skip creation of /usr/share/man/it/man1/vi.1.gz because associated file /usr/share/man/it/man1/vim.1.gz (of link group vi) doesn't exist
update-alternatives: warning: skip creation of /usr/share/man/pl/man1/vi.1.gz because associated file /usr/share/man/pl/man1/vim.1.gz (of link group vi) doesn't exist
update-alternatives: warning: skip creation of /usr/share/man/ru/man1/vi.1.gz because associated file /usr/share/man/ru/man1/vim.1.gz (of link group vi) doesn't exist
update-alternatives: warning: skip creation of /usr/share/man/ja/man1/vi.1.gz because associated file /usr/share/man/ja/man1/vim.1.gz (of link group vi) doesn't exist
update-alternatives: warning: skip creation of /usr/share/man/man1/vi.1.gz because associated file /usr/share/man/man1/vim.1.gz (of link group vi) doesn't exist
update-alternatives: using /usr/bin/vim.basic to provide /usr/bin/view (view) in auto mode
update-alternatives: warning: skip creation of /usr/share/man/fr/man1/view.1.gz because associated file /usr/share/man/fr/man1/vim.1.gz (of link group view) doesn't exist
update-alternatives: warning: skip creation of /usr/share/man/it/man1/view.1.gz because associated file /usr/share/man/it/man1/vim.1.gz (of link group view) doesn't exist
update-alternatives: warning: skip creation of /usr/share/man/pl/man1/view.1.gz because associated file /usr/share/man/pl/man1/vim.1.gz (of link group view) doesn't exist
update-alternatives: warning: skip creation of /usr/share/man/ru/man1/view.1.gz because associated file /usr/share/man/ru/man1/vim.1.gz (of link group view) doesn't exist
update-alternatives: warning: skip creation of /usr/share/man/ja/man1/view.1.gz because associated file /usr/share/man/ja/man1/vim.1.gz (of link group view) doesn't exist
update-alternatives: warning: skip creation of /usr/share/man/man1/view.1.gz because associated file /usr/share/man/man1/vim.1.gz (of link group view) doesn't exist
update-alternatives: using /usr/bin/vim.basic to provide /usr/bin/ex (ex) in auto mode
update-alternatives: warning: skip creation of /usr/share/man/fr/man1/ex.1.gz because associated file /usr/share/man/fr/man1/vim.1.gz (of link group ex) doesn't exist
update-alternatives: warning: skip creation of /usr/share/man/it/man1/ex.1.gz because associated file /usr/share/man/it/man1/vim.1.gz (of link group ex) doesn't exist
update-alternatives: warning: skip creation of /usr/share/man/pl/man1/ex.1.gz because associated file /usr/share/man/pl/man1/vim.1.gz (of link group ex) doesn't exist
update-alternatives: warning: skip creation of /usr/share/man/ru/man1/ex.1.gz because associated file /usr/share/man/ru/man1/vim.1.gz (of link group ex) doesn't exist
update-alternatives: warning: skip creation of /usr/share/man/ja/man1/ex.1.gz because associated file /usr/share/man/ja/man1/vim.1.gz (of link group ex) doesn't exist
update-alternatives: warning: skip creation of /usr/share/man/man1/ex.1.gz because associated file /usr/share/man/man1/vim.1.gz (of link group ex) doesn't exist
update-alternatives: using /usr/bin/vim.basic to provide /usr/bin/editor (editor) in auto mode
update-alternatives: warning: skip creation of /usr/share/man/fr/man1/editor.1.gz because associated file /usr/share/man/fr/man1/vim.1.gz (of link group editor) doesn't exist
update-alternatives: warning: skip creation of /usr/share/man/it/man1/editor.1.gz because associated file /usr/share/man/it/man1/vim.1.gz (of link group editor) doesn't exist
update-alternatives: warning: skip creation of /usr/share/man/pl/man1/editor.1.gz because associated file /usr/share/man/pl/man1/vim.1.gz (of link group editor) doesn't exist
update-alternatives: warning: skip creation of /usr/share/man/ru/man1/editor.1.gz because associated file /usr/share/man/ru/man1/vim.1.gz (of link group editor) doesn't exist
update-alternatives: warning: skip creation of /usr/share/man/ja/man1/editor.1.gz because associated file /usr/share/man/ja/man1/vim.1.gz (of link group editor) doesn't exist
update-alternatives: warning: skip creation of /usr/share/man/man1/editor.1.gz because associated file /usr/share/man/man1/vim.1.gz (of link group editor) doesn't exist
root@02b32b9272ce:/# vim ijing.py
root@02b32b9272ce:/# python  ijing.py
bash: python: command not found
root@02b32b9272ce:/# python3  ijing.py
h_i:  {0: -1, 1: -1, 2: -1, 3: -1, 4: -1}
Jij:  {(0, 1): -1, (0, 2): -1, (0, 3): -1, (0, 4): -1, (1, 2): -1, (1, 3): -1, (1, 4): -1, (2, 3): -1, (2, 4): -1, (3, 4): -1}

同じ結果が出た。OK。docker hubに保存(別のmac OSのshellで)

macOS
$ docker ps
CONTAINER ID        IMAGE               COMMAND             CREATED             STATUS              PORTS               NAMES
02b32b9272ce        ubuntu              "/bin/bash"         2 hours ago         Up 2 hours                              vigilant_blackburn
OgawaKiyoshi-no-MacBook-Pro:~ ogawakiyoshi$ docker commit 02b32b9272ce  kaizenjapan/ubuntu-openjij
sha256:a23f69a126e9a37ab1b4c1454013b2b23b41f9725cc6dc4189dc8de7f8f31e07
OgawaKiyoshi-no-MacBook-Pro:~ ogawakiyoshi$ docker push kaizenjapan/ubuntu-openjij
The push refers to repository [docker.io/kaizenjapan/ubuntu-openjij]
991134ca95c9: Pushed 
8d267010480f: Mounted from kaizenjapan/haskell 
270f934787ed: Mounted from kaizenjapan/haskell 
02571d034293: Mounted from kaizenjapan/haskell 
latest: digest: sha256:bd291395e3725727b8398a1c70c28a83a1da102ee191a3359399abaf4aaabeed size: 1156

利用する場合は、

$ docker run -it kaizejanpan/ubuntu-openjij /bin/bash

参考資料

文書履歴(document history)

ver. 0.01 初稿 20190625 午後
ver. 0.02 install 加筆 20190625 夕
ver. 0.03 docker hub 20190625 夜
ver. 0.04 誤植訂正 20191201

このエントリーをはてなブックマークに追加
https://b.hatena.ne.jp/guide/bbutton

kaizen_nagoya
I'm a network designer.I work on TOPPERS SmallestSetProfile Kernel,MISRA-C, STARC RTL Design StyleGuide (Verilog-HDL),HAZOP,ISO/IEC15504(AutomotiveSPICE),ISO26262. I was an editor on ISO/IEC 15504.
https://researchmap.jp/blogs/blog_entries/view/81777/f691323917cc4ea12caf0b03b34c8ea0?frame_id=442673
Why not register and get more from Qiita?
  1. We will deliver articles that match you
    By following users and tags, you can catch up information on technical fields that you are interested in as a whole
  2. you can read useful information later efficiently
    By "stocking" the articles you like, you can search right away